Peptide,PTM,ModifiedAA,ModifiedPosition,PeptideUniqueToGene,ExperimentDesc,ExpID,PubmedID,ScoreType,IdentScore,LocProb,Log2FChange,PQ-val,QuantSig,PEP,MassErrorPPM
GKPYPKSR,ac,K,19,false,"Quantitative Acetylproteomics",101,29440448,,,,,,,,
IRIYDVGMK,mox,M,38,false,"cat2 Methionine oxidation - 3h stress",62b,25693801,"MASCOT Score",42.0000000,,0.3402677,,NO,,
IYDVGMKR,ac,K,39,false,"Quantitative Acetylproteomics",101,29440448,,,,,,,,
IYDVGMKR,ub,K,39,false,"Arabidopsis ubiquitination COFRADIC",40,26744219,"MaxQuant Score",67.1690000,1.0000000,,,,0.0099999997764826,0.9870000
GVDEFPFCVHLVSWEK,so,C,49,false,"S-sulfenylation site detection using YAP1C",110,32714340,,,,,,,,
YMVKSAGK,ac,K,78,false,"Quantitative Acetylproteomics",101,29440448,,,,,,,,
SAGKDAFHLR,nt,S,79,false,"Arabidopsis translation initiation landscape - NT",167b,35069635,,,,,,,,
KMLSCAGADR,nt,K,101,false,"Metacaspase9 substrates - 35S:MC9 / mc9",51b,23964026,"MASCOT Score",46.0000000,,1.9972423,,NO,,-3.0669397
MLSCAGADR,ph,S,104,false,"Tissue atlas Arabidopsis - ProteomicsDB",114,32188942,"MaxQuant score",75.4740000,1.0000000,,,,0.0063407397828996,
MLSCAGADR,acy,C,105,false,"Arabidopsis S-acylation atlas - Meristem",163a,35681017,,,,,,,,
MLSCAGADRLQTGMR,ox,C,105,false,"OxiTRAQ Arabidopsis - 5 mM H2O2 versus control",47,24376095,,,,1.1986579,0.0119123,YES,,
MLSCAGADR,ox,C,105,false,"OxiTRAQ Arabidopsis - 5 mM H2O2 versus control",47,24376095,,,,1.1440682,0.0176168,YES,,
MLSCAGADR,ox,C,105,false,"SPEAR - 10 mM H2O2 / mock",138a,34619326,,,,1.1832003,0.0090877,YES,,
MLSCAGADR,ox,C,105,false,"SPEAR - 50 mM H2O2 / mock",138b,34619326,,,,1.4816571,0.0109332,YES,,
MLSCAGADR,sno,C,105,false,"hot5-4 / wildtype, FAT-switch S-nitrosoproteome",169,37277371,,,,0.0688199,0.6922824,NO,,
GAFGKALGTCAR,ac,K,121,false,"Histone deacetylases - apicidin vs control",98a,29061669,"MaxQuant Score",113.2000000,1.0000000,0.0180000,0.9418896,NO,7.2000002802278E-15,
GAFGKALGTCAR,ac,K,121,false,"Histone deacetylases substrates - TSA vs control",98b,29061669,"MaxQuant Score",113.2000000,1.0000000,1.0190000,0.2576321,NO,7.2000002802278E-15,
GAFGKALGTCAR,ub,K,121,false,"upl3 mutant / wildtype",168,35926874,"MaxQuant score",48.5680000,1.0000000,-0.9406447,0.1653580,NO,0.0060657002031803,-0.1894000
ALGTCAR,sno,C,126,false,"hot5-4 / wildtype, FAT-switch S-nitrosoproteome",169,37277371,,,,,,,,
ALGTCAR,so,C,126,false,"S-sulfenylation site detection using YAP1C",110,32714340,,,,,,,,
CKDNHGVHAQEALRR,so,C,140,true,"S-sulfenylation site detection using YAP1C",110,32714340,,,,,,,,
AKFKFPGR,nt,A,155,false,"Arabidopsis translation initiation landscape - NT",167b,35069635,,,,,,,,
AKFKFPGR,ub,K,158,false,"Arabidopsis ubiquitination COFRADIC",40,26744219,"MaxQuant Score",101.5400000,1.0000000,,,,0.0049999998882413,-0.2440000
AEYTKLR,ub,K,183,true,"Arabidopsis ubiquitination COFRADIC",40,26744219,"MaxQuant Score",104.4500000,1.0000000,,,,0.0049999998882413,0.2720000
SNHGPLANRQPGSAFISATSE,nt,S,201,true,"Arabidopsis translation initiation landscape - NT",167b,35069635,,,,,,,,
FLSNHGPLANR,ph,S,201,true,"Tissue atlas Arabidopsis - ProteomicsDB",114,32188942,"MaxQuant score",77.1570000,1.0000000,,,,0.00058445002650842,
QPGSAFISATSE,nt,Q,210,true,"HUNTER N-terminome: legumain, GluC and trypsin",119,31951383,"MaxQuant score",127.7600000,,,,,,
FLSNHGPLANRQPGSAFISATSE,ph,T,219,true,"Brassinosteroid-Regulated Phosphorylation Dynamics",94,26187819,"MaxQuant Score",79.4260000,0.7620000,,,,0.0040000001899898,-1.0320000
FLSNHGPLANRQPGSAFISATSE,ph,S,220,true,"MAPK Arabidopsis substrates",45,23172892,"MaxQuant Score",70.0940000,,,,,,
FLSNHGPLANRQPGSAFISATSE,ph,S,220,true,"Brassinosteroid-Regulated Phosphorylation Dynamics",94,26187819,"MaxQuant Score",84.0350000,0.9140000,,,,0.0040000001899898,-0.4910000
QPGSAFISATSE,ph,S,220,true,"Tyrosine phosphorylation in Arabidopsis",59,18463617,"MASCOT Score",56.0000000,,,,,,-0.2355671
QPGSAFISATSE,ph,S,220,true,"srk2dei ABA signaling phopshoproteomics",83,23572148,"MASCOT Score",50.0000000,,,,,,0.0000000
QPGSAFISATSE,ph,S,220,true,"SnRK2 protein kinase substrates",85,23776212,XCorr,2.6595593,0.9980000,,,,0.0053103799000382,
QPGSAFISATSE,ph,S,220,true,"atm and atr DNA damage response",88,25561503,"MASCOT Score",61.0000000,1.0000000,,,,,-0.5400000
QPGSAFISATSE,ph,S,220,true,"TOR Kinase and ABA Receptor",100,29290610,XCorr,3.6977751,0.9993000,,,,0.00028390000807121,
QPGSAFISATSE,ph,S,220,true,"Tissue atlas Arabidopsis - ProteomicsDB",114,32188942,"MaxQuant score",169.5700000,0.9872120,,,,9.1459798718871E-14,
