Peptide,PTM,ModifiedAA,ModifiedPosition,PeptideUniqueToGene,ExperimentDesc,ExpID,PubmedID,ScoreType,IdentScore,LocProb,Log2FChange,PQ-val,QuantSig,PEP,MassErrorPPM
ATIVASKEFT,nt,A,2,true,"N-term acetylation drought responses",5,26184543,,,,,,,,
ATIVASKEFTGNPRRQLAKLF,nta,A,2,true,"Arabidopsis translation initiation landscape - NTA",167a,35069635,,,,,,,,
ATIVASKEFTGNPR,nta,A,2,true,"Arg/N-end rule pathway Roots",80,25728785,"MASCOT Score",74.7300000,,,,,4.1079998482019E-5,
ATIVASKEFTGNPR,nta,A,2,true,"FtsH12 N-terminome: WT / FtsH12 knockdown miRNA",118,33216923,"MaxQuant score",71.3420000,,,,,0,
ATIVASKEFTGNPR,nta,A,2,true,"HUNTER N-terminome: legumain, GluC and trypsin",119,31951383,"MaxQuant score",93.8230000,,,,,,
ATIVASKEFTGN,nta,A,2,true,"HUNTER N-terminome: legumain, GluC and trypsin",119,31951383,"MaxQuant score",51.9270000,,,,,,
ATIVASKEFT,nta,A,2,true,"N-term acetylation drought responses",5,26184543,,,,,,,,
ATIVASK,nta,A,2,true,"Characterization plant N-terminal acetylation",6,22223895,"MASCOT Score",47.5800000,,,,,,
ATIVASKEFTGNPR,ub,K,8,true,"Arabidopsis ubiquitination COFRADIC",40,26744219,"MaxQuant Score",106.3200000,1.0000000,,,,9.7370000951003E-11,1.1950000
LSVKR,ac,K,129,false,"Lysine acetylation gel-based Arabidopsis",36,21311030,"MASCOT Score",26.0000000,,,,,,-0.0218000
AVVDFSSPNIAK,ph,S,137,false,"Tissue atlas Arabidopsis - ProteomicsDB",114,32188942,"MaxQuant score",147.3300000,0.9505360,,,,9.857959639703E-7,
AVVDFSSPNIAKEMHVGHLR,ac,K,142,false,"Histone deacetylases - apicidin vs control",98a,29061669,"MaxQuant Score",93.8000000,1.0000000,-0.1000000,0.7516229,NO,3.4999999597567E-16,
AVVDFSSPNIAKEMHVGHLR,ac,K,142,false,"Histone deacetylases- hda14 vs WT (low light)",98c,29061669,"MaxQuant Score",157.5400000,1.0000000,-1.0340000,0.9885531,NO,5.900000106529E-12,
AVVDFSSPNIAKEMHVGHLR,ac,K,142,false,"Histone deacetylases substrates - hda14 vs WT",98e,29061669,"MaxQuant Score",60.1000000,1.0000000,0.1150000,0.9078205,NO,1.9999999949505E-6,
ICEISR,so,C,250,true,"Arabidopsis S-sulfenylation chemoproteomics",108,31578252,"pFind PSM Score",0.1479560,,1.0638300,,,,0.7540260
FYSNCQVNGSAEETSR,so,C,553,true,"Arabidopsis S-sulfenylation chemoproteomics",108,31578252,"pFind PSM Score",0.0071617,,,,,,0.8905408
LLLCEATAIVMR,ox,C,568,false,"SPEAR - 10 mM H2O2 / mock",138a,34619326,,,,3.2739682,0.0028266,YES,,
LLLCEATAIVMR,so,C,568,false,"Arabidopsis S-sulfenylation chemoproteomics",108,31578252,"pFind PSM Score",0.2085000,,1.1363600,,,,1.5066221
