Peptide,PTM,ModifiedAA,ModifiedPosition,PeptideUniqueToGene,ExperimentDesc,ExpID,PubmedID,ScoreType,IdentScore,LocProb,Log2FChange,PQ-val,QuantSig,PEP,MassErrorPPM
LTGDITVLQNMTGLK,ng,N,230,true,"Conserved N-glycosylation",74,22633491,"MaxQuant Score",135.2600000,1.0000000,,,,6.7639999792185E-20,0.6510000
LTGDITVLQNMTGLK,ng,N,230,true,"N-linked Glycan Micro-heterogeneity Arabidopsis",134,29237727,,,,,,,,
LTGDITVLQNMTGLK,ng,N,230,true,"UDP-GlcNAc transporter glycopeptide analysis",135,30224661,,,,,,,2.4971832934817E-10,0.2000000
VVNLTNNHLQGPVPVFK,ng,N,285,true,"Conserved N-glycosylation",74,22633491,"MaxQuant Score",206.6800000,1.0000000,,,,0,-2.5310000
VVNLTNNHLQGPVPVFK,ng,N,285,true,"N-linked Glycan Micro-heterogeneity Arabidopsis",134,29237727,,,,,,,,
VVNLTNNHLQGPVPVFK,ng,N,285,true,"UDP-GlcNAc transporter glycopeptide analysis",135,30224661,,,,,,,1.4848885646038E-18,0.3000000
RFSGSESSNAVVVHPR,ph,S,516,true,"TOR Kinase and ABA Receptor",100,29290610,XCorr,4.7236571,0.8457000,,,,1.7830000160757E-6,
FSGSESSNAVVVHPR,ph,S,516,true,"atm and atr DNA damage response",88,25561503,"MASCOT Score",46.0000000,0.9930000,,,,,0.2700000
FSGSESSNAVVVHPR,ph,S,516,true,"Phosphorylation tonoplast membrane fraction",107,18686298,"MASCOT Score",57.0000000,,,,,,
FSGSESSNAVVVHPR,ph,S,516,true,"Tissue atlas Arabidopsis - ProteomicsDB",114,32188942,"MaxQuant score",170.4700000,0.9996140,,,,6.4753501604386E-18,
RFSGSESSNAVVVHPR,ph,S,518,true,"TOR Kinase and ABA Receptor",100,29290610,XCorr,4.8585515,0.9747000,,,,0.00096360000316054,
FSGSESSNAVVVHPR,ph,S,518,true,"Phosphorylation Early Elicitor Signaling",23,17317660,,,,,,,,
FSGSESSNAVVVHPR,ph,S,518,true,"Large-scale phosphorylation discovery",44,23111157,XCorr,3.3590000,,,,,,
FSGSESSNAVVVHPR,ph,S,518,true,"atm and atr DNA damage response",88,25561503,"MASCOT Score",60.0000000,1.0000000,,,,,0.0600000
FSGSESSNAVVVHPR,ph,S,518,true,"Phosphorylation tonoplast membrane fraction",107,18686298,"MASCOT Score",61.0000000,,,,,,
FSGSESSNAVVVHPR,ph,S,518,true,"Tissue atlas Arabidopsis - ProteomicsDB",114,32188942,"MaxQuant score",357.4600000,0.9980650,,,,0,
RFSGSESSNAVVVHPR,ph,S,519,true,"TOR Kinase and ABA Receptor",100,29290610,XCorr,4.8585515,0.9898000,,,,0.00096360000316054,
FSGSESSNAVVVHPR,ph,S,519,true,"Mitochondrial phosphoproteome",32,19688752,"MASCOT Score",42.0500000,,,,,,-3.8085500
FSGSESSNAVVVHPR,ph,S,519,true,"atm and atr DNA damage response",88,25561503,"MASCOT Score",66.0000000,0.9950000,,,,,0.5700000
FSGSESSNAVVVHPR,ph,S,519,true,"Tissue atlas Arabidopsis - ProteomicsDB",114,32188942,"MaxQuant score",185.6700000,0.9999030,,,,2.1299900181595E-25,
HSGSDNESVK,ph,S,529,true,"atm and atr DNA damage response",88,25561503,"MASCOT Score",57.0000000,1.0000000,,,,,-0.8000000
HSGSDNESVK,ph,S,531,true,"atm and atr DNA damage response",88,25561503,"MASCOT Score",57.0000000,1.0000000,,,,,-0.8000000
SEIAVLTKVR,ub,K,640,true,"Ubiquitination Membrane Proteins",120,33585938,,,,,,,,
SEIAVLTKVR,ub,K,640,true,"upl3 mutant / wildtype",168,35926874,"MaxQuant score",73.4990000,1.0000000,1.0922074,0.1424210,NO,0.0013947900151834,-0.2439000
LAPEGKGSIETR,ub,K,746,true,"Ubiquitination Membrane Proteins",120,33585938,,,,,,,,
LAPEGKGSIETR,ph,S,748,true,"Tissue atlas Arabidopsis - ProteomicsDB",114,32188942,"MaxQuant score",98.5070000,0.9966980,,,,3.7378500564955E-5,
