Peptide,PTM,ModifiedAA,ModifiedPosition,PeptideUniqueToGene,ExperimentDesc,ExpID,PubmedID,ScoreType,IdentScore,LocProb,Log2FChange,PQ-val,QuantSig,PEP,MassErrorPPM
KDSDEER,ph,S,71,true,"SnRK2 protein kinase substrates",85,23776212,XCorr,2.2072484,1.0000000,,,,0.18120799958706,
EQGNGQGESSDDEFDSR,ph,S,126,true,"atm and atr DNA damage response",88,25561503,"MASCOT Score",78.0000000,1.0000000,,,,,-0.6600000
EQGNGQGESSDDEFDSR,ph,S,126,true,"TOR Kinase and ABA Receptor",100,29290610,XCorr,5.2874055,1.0000000,,,,1.330000031885E-5,
EQGNGQGESSDDEFDSR,ph,S,126,true,"Lateral root-induction - NAA vs control",106,23328941,"MASCOT Score",25.0000000,,-0.1474960,0.4384898,NO,,
EQGNGQGESSDDEFDSR,ph,S,126,true,"Col-0 X-ray callus - FC Col-0 vs. Col-0 Xray",111b,31410901,,41.9700000,,0.0000000,0.0000000,NO,,0.8433447
EQGNGQGESSDDEFDSR,ph,S,127,true,"Tyrosine phosphorylation in Arabidopsis",59,18463617,"MASCOT Score",41.0000000,,,,,,-0.9815704
EQGNGQGESSDDEFDSR,ph,S,127,true,"SnRK2 protein kinase substrates",85,23776212,XCorr,3.4893487,0.9100000,,,,0.0023131200578064,
EQGNGQGESSDDEFDSR,ph,S,127,true,"atm and atr DNA damage response",88,25561503,"MASCOT Score",78.0000000,1.0000000,,,,,-0.6600000
EQGNGQGESSDDEFDSR,ph,S,127,true,"TOR Kinase and ABA Receptor",100,29290610,XCorr,5.2874055,1.0000000,,,,1.330000031885E-5,
EQGNGQGESSDDEFDSR,ph,S,127,true,"Lateral root-induction - NAA vs control",106,23328941,"MASCOT Score",25.0000000,,-0.1474960,0.4384898,NO,,
EQGNGQGESSDDEFDSR,ph,S,127,true,"Col-0 X-ray callus - FC Col-0 vs. Col-0 Xray",111b,31410901,,41.9700000,,0.0000000,0.0000000,NO,,0.8433447
EQGNGQGESSDDEFDSR,ph,S,127,true,"Tissue atlas Arabidopsis - ProteomicsDB",114,32188942,"MaxQuant score",223.6500000,1.0000000,,,,0,
QGSDITAMR,ph,S,209,true,"Tissue atlas Arabidopsis - ProteomicsDB",114,32188942,"MaxQuant score",103.6900000,1.0000000,,,,0.00087368098320439,
RLEDEFEPTVLSEK,ph,S,255,true,"Tissue atlas Arabidopsis - ProteomicsDB",114,32188942,"MaxQuant score",140.8900000,1.0000000,,,,3.9368901525449E-6,
SQYSICSK,so,C,476,false,"Arabidopsis S-sulfenylation chemoproteomics",108,31578252,"pFind PSM Score",0.1625810,,0.8771900,,,,-1.2474119
HMAAVEISCEPSVK,so,C,547,true,"Arabidopsis S-sulfenylation chemoproteomics",108,31578252,"pFind PSM Score",0.0010343,,,,,,-2.3159765
LISDCNEHYLSVGVSK,so,C,632,true,"Arabidopsis S-sulfenylation chemoproteomics",108,31578252,"pFind PSM Score",0.0012162,,1.5664400,,,,0.2905598
DIYDEDVRGDSNDDEDAIEMAIEHVR,ph,Y,1012,true,"SnRK2 protein kinase substrates",85,23776212,XCorr,3.0454571,0.9050000,,,,0.0010144900297746,
DIYDEDVRGDSNDDEDAIEMAIEHVR,ph,S,1020,true,"Arabidopsis root NAA phosphoproteome",18a,27643528,"MaxQuant Score",44.6250000,0.9130000,,,,0.00067789998138323,-1.2850000
DIYDEDVRGDSNDDEDAIEMAIEHVR,ph,S,1020,true,"SnRK2 protein kinase substrates",85,23776212,XCorr,5.3934689,0.9850000,,,,2.4969899641292E-6,
DIYDEDVRGDSNDDEDAIEMAIEHVR,ph,S,1020,true,"TOR Kinase and ABA Receptor",100,29290610,XCorr,6.2798662,0.9997000,,,,2.1519999116038E-9,
DIYDEDVRGDSNDDEDAIEMAIEHVR,ph,S,1020,true,"Phospho cell culture sucrose/TOR",109,30833711,,,0.9876950,,,,,
DIYDEDVRGDSNDDEDAIEMAIEHVR,ph,S,1020,true,"Col-0 callus - FC Col-0 vs. Col-0 Xray",111a,31410901,,48.7400000,,0.8733471,0.0000000,NO,,2.6113520
DIYDEDVRGDSNDDEDAIEMAIEHVR,ph,S,1020,true,"Col-0 X-ray callus - FC Col-0 vs. Col-0 Xray",111b,31410901,,48.7400000,,0.8733471,0.0000000,NO,,2.6113520
DIYDEDVRGDSNDDEDAIEMAIEHVR,ph,S,1020,true,"atm callus - FC atm vs. atm Xray",111c,31410901,,48.7400000,,2.4427032,0.0000000,NO,,2.6113520
DIYDEDVRGDSNDDEDAIEMAIEHVR,ph,S,1020,true,"atm-3 X-ray callus - FC atm vs. atm Xray",111d,31410901,,48.7400000,,2.4427032,0.0000000,NO,,2.6113520
GDSNDDEDAIEMAIEHVR,ph,S,1020,true,"Tissue atlas Arabidopsis - ProteomicsDB",114,32188942,"MaxQuant score",296.6000000,1.0000000,,,,0,
EGDILTCK,sno,C,1157,true,"hot5-4 / wildtype, FAT-switch S-nitrosoproteome",169,37277371,,,,1.0471545,0.0057146,YES,,
DITSLQCIGK,sno,C,1291,true,"hot5-4 / wildtype, FAT-switch S-nitrosoproteome",169,37277371,,,,0.7457803,0.0000724,YES,,
HIDDPLQESAPSIR,ph,S,1420,true,"Tissue atlas Arabidopsis - ProteomicsDB",114,32188942,"MaxQuant score",173.2800000,0.9999930,,,,6.3237600487654E-16,
VPMRSPADHGSSGGSGWGSSQSEGGWK,ph,S,1432,true,"TOR Kinase and ABA Receptor",100,29290610,XCorr,5.7660236,0.8057000,,,,4.0409999790825E-9,
VPMRSPADHGSSGGSGWGSSQSEGGWK,ph,S,1432,true,"Phospho cell culture sucrose/TOR",109,30833711,,,1.0000000,,,,,
VPMRSPADHGSSGGSGWGSSQSEGGWK,ph,S,1432,true,"Tissue atlas Arabidopsis - ProteomicsDB",114,32188942,"MaxQuant score",270.7800000,1.0000000,,,,0,
VPMRSPADHGSSGGSGWGSSQSEGGWK,ph,S,1438,true,"TOR Kinase and ABA Receptor",100,29290610,XCorr,3.3560150,0.7722000,,,,0.00042999998549931,
SGSGRGGEYR,me2,R,1464,true,"Arabidopsis protein methylome",123,31809900,"MaxQuant Score",52.2470000,1.0000000,,,,0.012244700454175,1.0379000
TGGGSTGGWGSESGGNK,ph,S,1544,true,"Tissue atlas Arabidopsis - ProteomicsDB",114,32188942,"MaxQuant score",82.7740000,0.9130430,,,,0.00021135600400157,
SDGAGSWGSGSGGGGSGGWGNDSGGKK,ph,S,1562,true,"Tissue atlas Arabidopsis - ProteomicsDB",114,32188942,"MaxQuant score",111.0600000,0.9992100,,,,1.1517500179463E-27,
SSEDGGFGSGSGGGGSDWGNESGGKK,ph,S,1594,true,"Tissue atlas Arabidopsis - ProteomicsDB",114,32188942,"MaxQuant score",174.1000000,0.9817530,,,,0,
SSEDGGFGSGSGGGGSDWGNESGGKK,ph,S,1605,true,"Tissue atlas Arabidopsis - ProteomicsDB",114,32188942,"MaxQuant score",210.2300000,0.9999700,,,,0,
