Peptide,PTM,ModifiedAA,ModifiedPosition,PeptideUniqueToGene,ExperimentDesc,ExpID,PubmedID,ScoreType,IdentScore,LocProb,Log2FChange,PQ-val,QuantSig,PEP,MassErrorPPM
FSEEVRGSFLDKSEVTDR,nt,F,36,true,"Mitochondrial intermediate peptidases - icp55 / WT",131a,25732537,,47.2100000,,6.6438562,,,,
SEEVRGSFLDKSEVTDRVLSVVKNF,nt,S,37,true,"Arabidopsis translation initiation landscape - NT",167b,35069635,,,,,,,,
SEEVRGSFLDKSEVTDR,nt,S,37,true,"Mitochondrial intermediate peptidases - icp55 / WT",131a,25732537,,60.0900000,,-1.1462768,,,,
SEEVRGSFLDKSEVTDR,nt,S,37,true,"Mitochondrial intermediate peptidases - oct1-1 / WT",131b,25732537,,69.5200000,,-0.5920367,,,,
SEEVRGSFLDKSEVTDR,nt,S,37,true,"Mitochondrial intermediate peptidases - oct1-2 / WT",131c,25732537,,59.0300000,,-0.7963883,,,,
GSFLDKSEVTDR,ac,K,47,true,"Histone deacetylases substrates - hda14 vs WT",98e,29061669,"MaxQuant Score",50.9000000,1.0000000,-0.1790000,0.7655966,NO,0.003000000026077,
GSFLDKSEVTDR,ac,K,47,true,"Quantitative Acetylproteomics",101,29440448,,,,,,,,
GSFLDKSEVTDR,ub,K,47,true,"Arabidopsis ubiquitination COFRADIC",40,26744219,"MaxQuant Score",155.6600000,1.0000000,,,,6.3140000260407E-29,-0.5640000
VLSVVKNFQK,ac,K,59,true,"Quantitative Acetylproteomics",101,29440448,,,,,,,,
