Peptide,PTM,ModifiedAA,ModifiedPosition,PeptideUniqueToGene,ExperimentDesc,ExpID,PubmedID,ScoreType,IdentScore,LocProb,Log2FChange,PQ-val,QuantSig,PEP,MassErrorPPM
ALISSFEDPE,nt,A,88,true,"Arg/N-end rule seed, prt6 vs. Wt",99,29168982,"MASCOT Score",45.0800000,,-0.3412094,0.2470897,NO,0.004048999864608,-5.8717253
MRQATAQVLASQK,mox,M,114,true,"cat2 Methionine oxidation - 1h stress",62a,25693801,"MASCOT Score",44.0000000,,0.6342084,,NO,,
QATAQVLASQKQLQNKYKAAQQSSDDWYKR,nt,Q,116,true,"HUNTER N-terminome: legumain, GluC and trypsin",119,31951383,"MaxQuant score",51.0250000,,,,,,
QLQNKYK,ac,K,131,true,"Quantitative Acetylproteomics",101,29440448,,,,,,,,
AAQQSSDDWYKR,ac,K,144,true,"Quantitative Acetylproteomics",101,29440448,,,,,,,,
AQLALAKGDEDLAR,ac,K,152,true,"Histone deacetylases substrates - TSA vs control",98b,29061669,"MaxQuant Score",90.7000000,1.0000000,-0.1410000,0.9977001,NO,4.5999999542801E-7,
AQLALAKGDEDLAR,ac,K,152,true,"Histone deacetylases - hda14 vs WT (thylakoids)",98d,29061669,"MaxQuant Score",72.9000000,1.0000000,0.1460000,0.9571941,NO,0.00020199999562465,
AQLALAKGDEDLAR,ub,K,152,true,"Arabidopsis ubiquitination COFRADIC",40,26744219,"MaxQuant Score",57.2880000,1.0000000,,,,6.5350002842024E-5,-0.7670000
RKSFADNATALK,ph,S,167,true,"atm and atr DNA damage response",88,25561503,"MASCOT Score",24.0000000,1.0000000,,,,,1.9600000
SFADNATALK,ph,S,167,true,"TOR Kinase and ABA Receptor",100,29290610,XCorr,2.9584527,1.0000000,,,,0.00041760000749491,
KSFADNATALK,ph,T,173,true,"Phosphorylation in N starvation",63,22060019,"MASCOT Score",20.0000000,,,,,,6.5647800
IQEAKAK,ac,K,204,true,"Quantitative Acetylproteomics",101,29440448,,,,,,,,
VQEMIGTVNTSGALSAFEK,ph,T,229,true,"Tissue atlas Arabidopsis - ProteomicsDB",114,32188942,"MaxQuant score",124.2000000,0.9997680,,,,1.9192299523718E-14,
