Peptide,PTM,ModifiedAA,ModifiedPosition,PeptideUniqueToGene,ExperimentDesc,ExpID,PubmedID,ScoreType,IdentScore,LocProb,Log2FChange,PQ-val,QuantSig,PEP,MassErrorPPM
LSKLSASK,ph,S,28,true,"Tissue atlas Arabidopsis - ProteomicsDB",114,32188942,"MaxQuant score",76.4160000,0.9975130,,,,0.0043990700505674,
LSKLSASK,ph,S,30,true,"Tissue atlas Arabidopsis - ProteomicsDB",114,32188942,"MaxQuant score",76.4160000,0.9999990,,,,0.00095610797870904,
SDSNSASPVPNTR,ph,S,32,true,"atm and atr DNA damage response",88,25561503,"MASCOT Score",48.0000000,1.0000000,,,,,-0.8500000
SDSNSASPVPNTR,ph,S,38,true,"Tissue atlas Arabidopsis - ProteomicsDB",114,32188942,"MaxQuant score",90.4760000,0.9984920,,,,0.00039639900205657,
LSLDRSPPTVNSKPTPDR,ph,S,50,true,"atm and atr DNA damage response",88,25561503,"MASCOT Score",54.0000000,1.0000000,,,,,0.3000000
LSLDRSPPTVNSKPTPDR,ph,S,50,true,"Col-0 callus - FC Col-0 vs. Col-0 Xray",111a,31410901,,23.2700000,,0.5005503,0.0000000,NO,,0.7031856
LSLDRSPPTVNSKPTPDR,ph,S,50,true,"Col-0 X-ray callus - FC Col-0 vs. Col-0 Xray",111b,31410901,,23.2700000,,0.5005503,0.0000000,NO,,0.7031856
LSLDRSPPTVNSKPTPDR,ph,S,50,true,"atm callus - FC atm vs. atm Xray",111c,31410901,,23.2700000,,-0.7241653,0.0000000,NO,,0.7031856
LSLDRSPPTVNSKPTPDR,ph,S,50,true,"atm-3 X-ray callus - FC atm vs. atm Xray",111d,31410901,,23.2700000,,-0.7241653,0.0000000,NO,,0.7031856
LSLDRSPPTVNSKPTPDR,ph,S,50,true,"Tissue atlas Arabidopsis - ProteomicsDB",114,32188942,"MaxQuant score",196.0200000,0.9987210,,,,1.4012984643248E-45,
LSLDRSPPTVNSK,ph,S,50,true,"atm and atr DNA damage response",88,25561503,"MASCOT Score",34.0000000,1.0000000,,,,,-1.1500000
IPTPEKVHSR,ph,T,69,true,"Tissue atlas Arabidopsis - ProteomicsDB",114,32188942,"MaxQuant score",88.0920000,0.9999910,,,,0.00070979801239446,
EAIEGNEIVSKLK,me2,K,259,true,"Arabidopsis protein methylome",123,31809900,"MaxQuant Score",175.1500000,1.0000000,,,,0,-0.4790300
SSASESMESVMKQLAELNHVLHETK,me2,K,342,true,"Arabidopsis protein methylome",123,31809900,"MaxQuant Score",63.3760000,1.0000000,,,,3.9066801349463E-8,-0.6197800
HGNSELNSIGK,ph,S,1181,true,"Tissue atlas Arabidopsis - ProteomicsDB",114,32188942,"MaxQuant score",69.3140000,0.9996230,,,,0.0036918800324202,
SREHMIQESPMEAIDK,ph,S,1213,true,"SnRK2 protein kinase substrates",85,23776212,XCorr,2.3473248,1.0000000,,,,0.035776600241661,
SREHMIQESPMEAIDK,ph,S,1213,true,"atm and atr DNA damage response",88,25561503,"MASCOT Score",48.0000000,1.0000000,,,,,0.8700000
SREHMIQESPMEAIDK,ph,S,1213,true,"TOR Kinase and ABA Receptor",100,29290610,XCorr,3.6360276,0.9997000,,,,0.0047180000692606,
SREHMIQESPMEAIDK,ph,S,1213,true,"Tissue atlas Arabidopsis - ProteomicsDB",114,32188942,"MaxQuant score",52.0190000,0.9999680,,,,0.0014061899855733,
MWDSYKIEK,ph,S,1261,true,"Tissue atlas Arabidopsis - ProteomicsDB",114,32188942,"MaxQuant score",117.9500000,0.9999920,,,,0.00061364501016214,
SEVSPERETELDSVEEEVDSK,ph,S,1267,true,"srk2dei ABA signaling phopshoproteomics",83,23572148,"MASCOT Score",78.0000000,,,,,,0.0010000
SEVSPERETELDSVEEEVDSK,ph,S,1267,true,"TOR Kinase and ABA Receptor",100,29290610,XCorr,5.1237783,0.8407000,,,,1.2800000149582E-5,
IEKSEVSPER,ph,S,1267,true,"Tissue atlas Arabidopsis - ProteomicsDB",114,32188942,"MaxQuant score",108.1800000,1.0000000,,,,4.0562900260888E-12,
SEVSPERETELDSVEEEVDSK,ph,S,1270,true,"Arabidopsis root NAA phosphoproteome",18a,27643528,"MaxQuant Score",101.4500000,0.9950000,,,,1.7929999932692E-12,1.2540000
SEVSPERETELDSVEEEVDSK,ph,S,1270,true,"srk2dei ABA signaling phopshoproteomics",83,23572148,"MASCOT Score",78.0000000,,,,,,-0.0002000
SEVSPERETELDSVEEEVDSK,ph,S,1270,true,"LAXIC - ABA stress",84a,23660473,XCorr,6.2400000,0.8630000,,,,1.6999999843392E-6,
SEVSPERETELDSVEEEVDSK,ph,S,1270,true,"LAXIC - mannitol vs control",84b,23660473,XCorr,6.5800000,0.8760000,,,,1.0799999783373E-11,
SEVSPERETELDSVEEEVDSK,ph,S,1270,true,"SnRK2 protein kinase substrates",85,23776212,XCorr,5.4949355,0.9050000,,,,1.0451599844917E-13,
SEVSPERETELDSVEEEVDSK,ph,S,1270,true,"Brassinosteroid-Regulated Phosphorylation Dynamics",94,26187819,"MaxQuant Score",166.5700000,0.9750000,,,,9.4009995481834E-22,0.7610000
SEVSPERETELDSVEEEVDSK,ph,S,1270,true,"TOR Kinase and ABA Receptor",100,29290610,XCorr,5.2372112,0.9826000,,,,9.449999924982E-5,
SEVSPERETELDSVEEEVDSK,ph,S,1270,true,"Phospho cell culture sucrose/TOR",109,30833711,,,0.9999950,,,,,
SEVSPERETELDSVEEEVDSK,ph,S,1270,true,"Col-0 callus - FC Col-0 vs. Col-0 Xray",111a,31410901,,61.3800000,,0.1180753,0.0000000,NO,,1.4946703
SEVSPERETELDSVEEEVDSK,ph,S,1270,true,"Col-0 X-ray callus - FC Col-0 vs. Col-0 Xray",111b,31410901,,61.3800000,,0.1180753,0.0000000,NO,,1.4946703
SEVSPERETELDSVEEEVDSK,ph,S,1270,true,"atm callus - FC atm vs. atm Xray",111c,31410901,,61.3800000,,0.5678508,0.0000000,NO,,1.4946703
SEVSPERETELDSVEEEVDSK,ph,S,1270,true,"atm-3 X-ray callus - FC atm vs. atm Xray",111d,31410901,,61.3800000,,0.5678508,0.0000000,NO,,1.4946703
IEKSEVSPER,ph,S,1270,true,"Tissue atlas Arabidopsis - ProteomicsDB",114,32188942,"MaxQuant score",252.7300000,1.0000000,,,,0,
SEVSPERETELDSVEEEVDSK,ph,T,1275,true,"Large-scale phosphorylation discovery",44,23111157,XCorr,6.4990000,,,,,,
SEVSPERETELDSVEEEVDSK,ph,T,1275,true,"srk2dei ABA signaling phopshoproteomics",83,23572148,"MASCOT Score",99.0000000,,,,,,-0.0003000
SEVSPERETELDSVEEEVDSK,ph,T,1275,true,"LAXIC - mannitol vs control",84b,23660473,XCorr,5.8400000,0.9940000,,,,0.00063533097272739,
ETELDSVEEEVDSK,ph,T,1275,true,"srk2dei ABA signaling phopshoproteomics",83,23572148,"MASCOT Score",47.0000000,,,,,,0.0004000
ETELDSVEEEVDSK,ph,T,1275,true,"Tissue atlas Arabidopsis - ProteomicsDB",114,32188942,"MaxQuant score",119.5400000,1.0000000,,,,1.0086900147144E-5,
SEVSPERETELDSVEEEVDSK,ph,S,1279,true,"Arabidopsis root NAA phosphoproteome",18a,27643528,"MaxQuant Score",69.4920000,0.9980000,,,,2.0529998892016E-6,0.1010000
SEVSPERETELDSVEEEVDSK,ph,S,1279,true,"srk2dei ABA signaling phopshoproteomics",83,23572148,"MASCOT Score",68.0000000,,,,,,0.0000000
SEVSPERETELDSVEEEVDSK,ph,S,1279,true,"LAXIC - ABA stress",84a,23660473,XCorr,5.5700000,0.9960000,,,,7.6100002388557E-7,
SEVSPERETELDSVEEEVDSK,ph,S,1279,true,"LAXIC - mannitol vs control",84b,23660473,XCorr,6.5800000,1.0000000,,,,1.0799999783373E-11,
SEVSPERETELDSVEEEVDSK,ph,S,1279,true,"SnRK2 protein kinase substrates",85,23776212,XCorr,5.6497493,1.0000000,,,,2.2502699703608E-9,
SEVSPERETELDSVEEEVDSK,ph,S,1279,true,"Brassinosteroid-Regulated Phosphorylation Dynamics",94,26187819,"MaxQuant Score",166.5700000,1.0000000,,,,9.4009995481834E-22,0.7610000
SEVSPERETELDSVEEEVDSK,ph,S,1279,true,"TOR Kinase and ABA Receptor",100,29290610,XCorr,5.2372112,0.9830000,,,,9.449999924982E-5,
SEVSPERETELDSVEEEVDSK,ph,S,1279,true,"Col-0 callus - FC Col-0 vs. Col-0 Xray",111a,31410901,,68.0900000,,0.4418199,0.0000000,NO,,0.9309127
SEVSPERETELDSVEEEVDSK,ph,S,1279,true,"Col-0 X-ray callus - FC Col-0 vs. Col-0 Xray",111b,31410901,,68.0900000,,0.4418199,0.0000000,NO,,0.9309127
SEVSPERETELDSVEEEVDSK,ph,S,1279,true,"atm callus - FC atm vs. atm Xray",111c,31410901,,68.0900000,,0.0588865,0.0000000,NO,,0.9309127
SEVSPERETELDSVEEEVDSK,ph,S,1279,true,"atm-3 X-ray callus - FC atm vs. atm Xray",111d,31410901,,68.0900000,,0.0588865,0.0000000,NO,,0.9309127
SEVSPERETELDSVEEEVDSK,ph,S,1279,true,"Tissue atlas Arabidopsis - ProteomicsDB",114,32188942,"MaxQuant score",393.1000000,1.0000000,,,,0,
ETELDSVEEEVDSK,ph,S,1279,true,"STN8 phosphoproteome",38,21768351,"MASCOT Score",79.5200000,,,,,,-1.4620400
ETELDSVEEEVDSK,ph,S,1279,true,"Chloroplast kinase substrates",60,19376835,"MASCOT Score",80.3300000,,,,,,-1.7697900
ETELDSVEEEVDSK,ph,S,1279,true,"srk2dei ABA signaling phopshoproteomics",83,23572148,"MASCOT Score",64.0000000,,,,,,0.0000000
ETELDSVEEEVDSK,ph,S,1279,true,"LAXIC - ABA stress",84a,23660473,XCorr,3.8500000,1.0000000,,,,6.299999949988E-5,
ETELDSVEEEVDSK,ph,S,1279,true,"LAXIC - mannitol vs control",84b,23660473,XCorr,4.2200000,1.0000000,-1.3191988,,NO,8.0300002758271E-11,
ETELDSVEEEVDSK,ph,S,1279,true,"SnRK2 protein kinase substrates",85,23776212,XCorr,3.5025148,1.0000000,,,,8.2674702639451E-8,
ETELDSVEEEVDSK,ph,S,1279,true,"Lateral root-induction - NAA vs control",106,23328941,"MASCOT Score",20.0000000,,,,,,
ETELDSVEEEVDSK,ph,S,1279,true,"Col-0 callus - FC Col-0 vs. Col-0 Xray",111a,31410901,,51.9500000,,0.4916617,0.0000000,NO,,1.0111262
ETELDSVEEEVDSK,ph,S,1279,true,"Col-0 X-ray callus - FC Col-0 vs. Col-0 Xray",111b,31410901,,51.9500000,,0.4916617,0.0000000,NO,,1.0111262
ETELDSVEEEVDSK,ph,S,1279,true,"atm callus - FC atm vs. atm Xray",111c,31410901,,51.9500000,,-0.2709170,0.0000000,NO,,1.0111262
ETELDSVEEEVDSK,ph,S,1279,true,"atm-3 X-ray callus - FC atm vs. atm Xray",111d,31410901,,51.9500000,,-0.2709170,0.0000000,NO,,1.0111262
ETELDSVEEEVDSK,ph,S,1286,true,"Tissue atlas Arabidopsis - ProteomicsDB",114,32188942,"MaxQuant score",315.1300000,1.0000000,,,,0,
AESSENMDQYSNGFSLTDHTEDSGNLLLK,ph,S,1290,true,"Tissue atlas Arabidopsis - ProteomicsDB",114,32188942,"MaxQuant score",222.7100000,0.7503630,,,,0,
