Peptide,PTM,ModifiedAA,ModifiedPosition,PeptideUniqueToGene,ExperimentDesc,ExpID,PubmedID,ScoreType,IdentScore,LocProb,Log2FChange,PQ-val,QuantSig,PEP,MassErrorPPM
AVRSSISAPQTQTINTE,nt,A,15,true,"HUNTER N-terminome: legumain, GluC and trypsin",119,31951383,"MaxQuant score",139.3000000,,,,,,
AVRSSISAPQTQTIN,nt,A,15,true,"HUNTER N-terminome: legumain, GluC and trypsin",119,31951383,"MaxQuant score",88.0870000,,,,,,
VRSSISAPQTQTINTE,nt,V,16,true,"HUNTER N-terminome: legumain, GluC and trypsin",119,31951383,"MaxQuant score",175.8800000,,,,,,
VRSSISAPQTQTINTE,nta,V,16,true,"HUNTER N-terminome: legumain, GluC and trypsin",119,31951383,"MaxQuant score",195.7100000,,,,,,
VRSSISAPQTQTIN,nta,V,16,true,"HUNTER N-terminome: legumain, GluC and trypsin",119,31951383,"MaxQuant score",128.6700000,,,,,,
SSISAPQTQTINTE,nt,S,18,true,"HUNTER N-terminome: legumain, GluC and trypsin",119,31951383,"MaxQuant score",121.9600000,,,,,,
SISAPQTQTINTEKLEDKFGR,nt,S,19,true,"HUNTER N-terminome: legumain, GluC and trypsin",119,31951383,"MaxQuant score",82.4060000,,,,,,
SISAPQTQTINTE,nt,S,19,true,"Arg/N-end rule seed, prt6 vs. Wt",99,29168982,"MASCOT Score",47.9600000,,1.3920686,0.2912752,NO,0.00017739999748301,-1.0018693
SISAPQTQTINTE,nt,S,19,true,"HUNTER N-terminome: legumain, GluC and trypsin",119,31951383,"MaxQuant score",214.8200000,,,,,,
SISAPQTQTIN,nt,S,19,true,"HUNTER N-terminome: legumain, GluC and trypsin",119,31951383,"MaxQuant score",119.6200000,,,,,,
SISAPQTQTINTEKLEDKFGR,nta,S,19,true,"HUNTER N-terminome: legumain, GluC and trypsin",119,31951383,"MaxQuant score",105.6700000,,,,,,
SISAPQTQTINTE,nta,S,19,true,"HUNTER N-terminome: legumain, GluC and trypsin",119,31951383,"MaxQuant score",311.8800000,,,,,,
SISAPQTQTIN,nta,S,19,true,"HUNTER N-terminome: legumain, GluC and trypsin",119,31951383,"MaxQuant score",161.5100000,,,,,,
LSLSDAHVLSYKPK,ac,K,76,true,"Histone deacetylases - apicidin vs control",98a,29061669,"MaxQuant Score",84.3000000,1.0000000,0.1940000,0.3953666,NO,2.7000000045518E-5,
LSLSDAHVLSYKPK,ac,K,76,true,"Histone deacetylases - hda14 vs WT (thylakoids)",98d,29061669,"MaxQuant Score",76.8000000,1.0000000,2.1110000,0.5333349,NO,2.8700000257231E-5,
GGSSVISGCDWSVK,ox,C,122,true,"SPEAR - 10 mM H2O2 / mock",138a,34619326,,,,0.9429638,0.0061944,YES,,
GGSSVISGCDWSVK,sno,C,122,true,"Site-specific nitrosomeproteomic id - gsnor1-3",90a,25699590,XCorr,3.0345061,,,,,0.00049559999024495,-5.4553084
GGSSVISGCDWSVK,sno,C,122,true,"Site-specific nitrosomeproteomic id - gsnor1-3",90b,25699590,XCorr,2.9900000,,,,,0.018789999186993,-6.9900000
