Peptide,PTM,ModifiedAA,ModifiedPosition,PeptideUniqueToGene,ExperimentDesc,ExpID,PubmedID,ScoreType,IdentScore,LocProb,Log2FChange,PQ-val,QuantSig,PEP,MassErrorPPM
QLFHPEQLISGKEDAANNFAR,nt,Q,85,false,"HUNTER N-terminome: legumain, GluC and trypsin",119,31951383,"MaxQuant score",125.7900000,,,,,,
QLFHPEQLISGKEDAANNFAR,nt,Q,85,false,"Arabidopsis translation initiation landscape - NT",167b,35069635,,,,,,,,
HPEQLISGKEDAANNF,nt,H,88,false,"Arabidopsis translation initiation landscape - NT",167b,35069635,,,,,,,,
QLISGKE,nt,Q,91,false,"Arg/N-end rule seed, prt6 vs. Wt",99,29168982,"MASCOT Score",25.9100000,,,,,0.035480000078678,-1.5625244
QLFHPEQLISGKEDAANNFAR,cr,K,96,false,"Open search Plant PTM Viewer 2.0 - Crotonylation",164c,TBA,,,,,,,,
EDAANNFAR,nt,E,97,false,"Metacaspase9 substrates - in vitro rMC9",51c,23964026,"MASCOT Score",53.0000000,,5.6204049,,NO,,-0.0928946
AVGGGTGSGLGSLLLERLSV,nt,A,140,false,"Arabidopsis translation initiation landscape - NT",167b,35069635,,,,,,,,
AVGGGTGSGLGSLLLER,nt,A,140,false,"Arg/N-end rule seed, prt6 vs. Wt",99,29168982,"MASCOT Score",76.4000000,,-0.2363320,0.0182432,NO,9.8140000773128E-5,-0.7935783
AVGGGTGSGLGSLLLER,nt,A,140,false,"FtsH12 N-terminome: WT / FtsH12 knockdown miRNA",118,33216923,"MaxQuant score",76.3320000,,,,,0.012161999940872,
EFQTNLVPYPR,nt,E,254,false,"FtsH12 N-terminome: WT / FtsH12 knockdown miRNA",118,33216923,"MaxQuant score",154.4700000,,1.8229346,0.0109914,YES,0,
CDPRHGK,so,C,305,false,"S-sulfenylation site detection using YAP1C",110,32714340,,,,,,,,
HGKYMACCLMYR,nt,H,309,false,"Arabidopsis translation initiation landscape - NT",167b,35069635,,,,,,,,
YMACCLMYR,acy,C,315,false,"Arabidopsis S-acylation atlas - Meristem",163a,35681017,,,,,,,,
YMACCLMYR,acy,C,315,false,"Arabidopsis S-acylation atlas - Hypocotyl",163b,35681017,,,,,,,,
YMACCLMYR,acy,C,315,false,"Arabidopsis S-acylation atlas - Silique",163e,35681017,,,,,,,,
YMACCLMYR,so,C,315,false,"Arabidopsis S-sulfenylation chemoproteomics",108,31578252,"pFind PSM Score",0.0899234,,1.0747300,,,,-0.3493128
YMACCLMYR,so,C,315,false,"S-sulfenylation site detection using YAP1C",110,32714340,,,,,,,,
YMACCLMYR,acy,C,316,false,"Arabidopsis S-acylation atlas - Meristem",163a,35681017,,,,,,,,
YMACCLMYR,acy,C,316,false,"Arabidopsis S-acylation atlas - Silique",163e,35681017,,,,,,,,
TIQFVDWCPTGFK,sno,C,347,false,"Site-specific nitrosomeproteomic id - gsnor1-3",90a,25699590,XCorr,3.7618690,,,,,5.2190000587871E-7,-4.5602018
TIQFVDWCPTGFK,sno,C,347,false,"Site-specific nitrosomeproteomic id - gsnor1-3",90b,25699590,XCorr,4.0579257,,,,,0.036609999835491,-7.0102780
TIQFVDWCPTGFK,so,C,347,false,"S-sulfenylation site detection using YAP1C",110,32714340,,,,,,,,
RTIQFVDWCPTGFK,ph,T,349,false,"srk2dei ABA signaling phopshoproteomics",83,23572148,"MASCOT Score",41.0000000,,,,,,-0.0002000
RTIQFVDWCPTGFK,ph,T,349,false,"Brassinosteroid-Regulated Phosphorylation Dynamics",94,26187819,"MaxQuant Score",142.8500000,1.0000000,,,,3.1899999157758E-5,2.3960000
RTIQFVDWCPTGFK,ph,T,349,false,"TOR Kinase and ABA Receptor",100,29290610,XCorr,3.2559817,1.0000000,,,,0.010759999975562,
TIQFVDWCPTGFK,ph,T,349,false,"Arabidopsis root NAA phosphoproteome",18a,27643528,"MaxQuant Score",116.0600000,1.0000000,,,,2.1139999473174E-11,-0.2750000
TIQFVDWCPTGFK,ph,T,349,false,"Phosphoproteome iron-deficient Arabidopsis roots",41,22438062,"MASCOT Score",59.6700000,,,,,,
TIQFVDWCPTGFK,ph,T,349,false,"Pollen phosphoproteome Arabidopsis",43,22631563,"MASCOT Score",72.6000000,,,,,,
TIQFVDWCPTGFK,ph,T,349,false,"Large-scale phosphorylation discovery",44,23111157,XCorr,4.1170000,,,,,,
TIQFVDWCPTGFK,ph,T,349,false,"srk2dei ABA signaling phopshoproteomics",83,23572148,"MASCOT Score",56.0000000,,,,,,0.0002000
TIQFVDWCPTGFK,ph,T,349,false,"SnRK2 protein kinase substrates",85,23776212,XCorr,3.6083372,1.0000000,,,,0.0016899999463931,
TIQFVDWCPTGFK,ph,T,349,false,"TOR Kinase and ABA Receptor",100,29290610,XCorr,4.5480337,1.0000000,,,,6.6150000748166E-6,
TIQFVDWCPTGFK,ph,T,349,false,"Lateral root-induction - NAA vs control",106,23328941,"MASCOT Score",39.0000000,,,,,,
TIQFVDWCPTGFK,ph,T,349,false,"Phospho cell culture sucrose/TOR",109,30833711,,,1.0000000,,,,,
TIQFVDWCPTGFK,ph,T,349,false,"Col-0 callus - FC Col-0 vs. Col-0 Xray",111a,31410901,,49.4500000,,-0.4743355,0.0000000,NO,,0.8507013
TIQFVDWCPTGFK,ph,T,349,false,"Col-0 X-ray callus - FC Col-0 vs. Col-0 Xray",111b,31410901,,49.4500000,,-0.4743355,0.0000000,NO,,0.8507013
TIQFVDWCPTGFK,ph,T,349,false,"atm callus - FC atm vs. atm Xray",111c,31410901,,49.4500000,,-0.9740693,0.0000000,NO,,0.8507013
TIQFVDWCPTGFK,ph,T,349,false,"atm-3 X-ray callus - FC atm vs. atm Xray",111d,31410901,,49.4500000,,-0.9740693,0.0000000,NO,,0.8507013
TIQFVDWCPTGFK,ph,T,349,false,"Tissue atlas Arabidopsis - ProteomicsDB",114,32188942,"MaxQuant score",302.4100000,1.0000000,,,,0,
TIQFVDWCPTGFK,ph,T,349,false,"Touch-induced phosphorylation: 40s touch vs untouc",136,30291188,"MASCOT score",55.8700000,,1.0738879,0.0293382,YES,,4.0351855
CGINYQPPSVVPGGDLAK,sno,C,353,true,"hot5-4 / wildtype, FAT-switch S-nitrosoproteome",169,37277371,,,,-0.0070373,0.8727315,NO,,
AVCMISNNTAVAEVFSR,ox,C,376,false,"SPEAR - 50 mM H2O2 / mock",138b,34619326,,,,-1.0055132,0.0277277,YES,,
AVCMISNNTAVAEVFSR,so,C,376,false,"Arabidopsis S-sulfenylation chemoproteomics",108,31578252,"pFind PSM Score",0.0000549,,1.3460200,,,,-1.7951917
AVCMISNNTAVAEVFSR,so,C,376,false,"S-sulfenylation site detection using YAP1C",110,32714340,,,,,,,,
MISNNTAVAE,nt,M,377,false,"Arg/N-end rule seed, prt6 vs. Wt",99,29168982,"MASCOT Score",66.4000000,,-0.5904113,0.0231042,NO,3.6869998439215E-5,-0.8574669
ISNNTAVAE,nt,I,378,false,"Arg/N-end rule seed, prt6 vs. Wt",99,29168982,"MASCOT Score",43.9800000,,-0.5904656,0.2634886,NO,0.0059279999695718,-1.0855723
SRIDHKFDLMY,nt,S,389,false,"Arabidopsis translation initiation landscape - NT",167b,35069635,,,,,,,,
