Peptide,PTM,ModifiedAA,ModifiedPosition,PeptideUniqueToGene,ExperimentDesc,ExpID,PubmedID,ScoreType,IdentScore,LocProb,Log2FChange,PQ-val,QuantSig,PEP,MassErrorPPM
FEHEDDEKPPR,ub,K,47,true,"upl3 mutant / wildtype",168,35926874,"MaxQuant score",103.4300000,1.0000000,0.3459640,0.0935620,NO,0.00010492900037207,0.9079800
TWEEVSKSLETK,ph,S,81,true,"atm and atr DNA damage response",88,25561503,"MASCOT Score",25.0000000,0.9290000,,,,,-4.6200000
TWEEVSKSLETK,ph,S,81,true,"Tissue atlas Arabidopsis - ProteomicsDB",114,32188942,"MaxQuant score",118.2000000,0.8704490,,,,3.9914801163832E-5,
LKPAAVKPPEVDSVKPPATPPRR,ph,T,104,true,"TOR Kinase and ABA Receptor",100,29290610,XCorr,3.0110185,0.9742000,,,,1.9080000129179E-5,
LKPAAVKPPEVDSVKPPATPPR,ph,T,104,true,"Phosphoproteome ethylene-regulated time response",46,24043427,"MASCOT Score",62.6800000,,,,,,-8.5106000
LKPAAVKPPEVDSVKPPATPPR,ph,T,104,true,"Chloroplast kinase substrates",60,19376835,"MASCOT Score",35.3200000,,,,,,-0.3138970
LKPAAVKPPEVDSVKPPATPPR,ph,T,104,true,"TOR Kinase and ABA Receptor",100,29290610,XCorr,2.1601560,0.9999000,,,,0.0002673999988474,
KSASFHTLDELEVR,ph,S,113,true,"MAPK Arabidopsis substrates",45,23172892,"MaxQuant Score",80.5340000,,,,,,
KSASFHTLDELEVR,ph,S,113,true,"Tissue atlas Arabidopsis - ProteomicsDB",114,32188942,"MaxQuant score",170.0600000,0.9999920,,,,2.1339900580686E-16,
SASFHTLDELEVR,ph,S,113,true,"srk2dei ABA signaling phopshoproteomics",83,23572148,"MASCOT Score",32.0000000,,,,,,-0.0009000
SASFHTLDELEVR,ph,S,113,true,"LAXIC - ABA stress",84a,23660473,XCorr,2.4600000,0.8940000,,,,0.095267198979855,
SASFHTLDELEVR,ph,S,113,true,"SnRK2 protein kinase substrates",85,23776212,XCorr,2.8348355,0.9340000,,,,0.011553900316358,
SASFHTLDELEVR,ph,S,113,true,"Lateral root-induction - NAA vs control",106,23328941,"MASCOT Score",32.0000000,,,,,,
KSASFHTLDELEVR,ph,S,115,true,"Large-scale phosphorylation discovery",44,23111157,XCorr,4.2670000,,,,,,
KSASFHTLDELEVR,ph,S,115,true,"MAPK Arabidopsis substrates",45,23172892,"MaxQuant Score",213.6700000,,,,,,
KSASFHTLDELEVR,ph,S,115,true,"Phosphoproteome ethylene-regulated time response",46,24043427,"MASCOT Score",137.0000000,,,,,,-22.2569000
KSASFHTLDELEVR,ph,S,115,true,"atm and atr DNA damage response",88,25561503,"MASCOT Score",81.0000000,1.0000000,,,,,-0.8400000
SASFHTLDELEVR,ph,S,115,true,"STN8 phosphoproteome",38,21768351,"MASCOT Score",46.2000000,,,,,,0.2157290
SASFHTLDELEVR,ph,S,115,true,"Phosphoproteome ethylene-regulated time response",46,24043427,"MASCOT Score",58.0000000,,,,,,7.0031000
SASFHTLDELEVR,ph,S,115,true,"Tyrosine phosphorylation in Arabidopsis",59,18463617,"MASCOT Score",43.0000000,,,,,,-0.7581972
SASFHTLDELEVR,ph,S,115,true,"srk2dei ABA signaling phopshoproteomics",83,23572148,"MASCOT Score",68.0000000,,,,,,-0.0001000
SASFHTLDELEVR,ph,S,115,true,"atm and atr DNA damage response",88,25561503,"MASCOT Score",67.0000000,0.9960000,,,,,-0.2500000
SASFHTLDELEVR,ph,S,115,true,"Lateral root-induction - NAA vs control",106,23328941,"MASCOT Score",25.0000000,,,,,,
SASFHTLDELEVR,ph,S,115,true,"Phospho cell culture sucrose/TOR",109,30833711,,,0.7947790,,,,,
SASFHTLDELEVR,ph,S,115,true,"Tissue atlas Arabidopsis - ProteomicsDB",114,32188942,"MaxQuant score",265.8900000,0.9999950,,,,0,
KSASFHTLDELEVR,ph,T,118,true,"Tissue atlas Arabidopsis - ProteomicsDB",114,32188942,"MaxQuant score",146.2000000,0.8677640,,,,2.992310044192E-7,
SASFHTLDELEVR,ph,T,118,true,"srk2dei ABA signaling phopshoproteomics",83,23572148,"MASCOT Score",40.0000000,,,,,,-0.0012000
LRPESDDRTESTQSSYSGPR,ph,S,166,true,"atm and atr DNA damage response",88,25561503,"MASCOT Score",25.0000000,0.8730000,,,,,0.0600000
TESTQSSYSGPR,ph,S,166,true,"atm and atr DNA damage response",88,25561503,"MASCOT Score",70.0000000,0.9940000,,,,,0.9700000
TESTQSSYSGPR,ph,S,166,true,"Tissue atlas Arabidopsis - ProteomicsDB",114,32188942,"MaxQuant score",181.0800000,0.9836550,,,,1.05032001449E-19,
LRPESDDRTESTQSSYSGPRSVK,ph,S,170,true,"TOR Kinase and ABA Receptor",100,29290610,XCorr,3.4216642,0.7673000,,,,0.076370000839233,
