Peptide,PTM,ModifiedAA,ModifiedPosition,PeptideUniqueToGene,ExperimentDesc,ExpID,PubmedID,ScoreType,IdentScore,LocProb,Log2FChange,PQ-val,QuantSig,PEP,MassErrorPPM
MQYYENR,nta,M,1,true,"Arg/N-end rule seed, prt6 vs. Wt",99,29168982,"MASCOT Score",47.8300000,,,,,0.18230000138283,-0.3212319
EKDYYEVAQGQR,ub,K,9,true,"upl3 mutant / wildtype",168,35926874,"MaxQuant score",46.8800000,1.0000000,0.2128806,0.8082600,NO,0.023734400048852,-0.5873700
NGYGQSQSHNHEGYGQSQSR,ph,S,25,true,"Tissue atlas Arabidopsis - ProteomicsDB",114,32188942,"MaxQuant score",103.6300000,0.9600000,,,,3.3528599896471E-9,
NGYGQSQSHNHEGYGQSQSR,ph,S,27,true,"Tissue atlas Arabidopsis - ProteomicsDB",114,32188942,"MaxQuant score",218.0000000,0.9937050,,,,0,
NGYGQSQSHNHEGYGQSQSR,ph,S,38,true,"Tissue atlas Arabidopsis - ProteomicsDB",114,32188942,"MaxQuant score",61.4370000,0.7581710,,,,0.00011035300121875,
EGYSQSQSRPVYGLSPTLNHR,og,S,59,true,"O-GlcNac Inflorescence Tissue",81,28154133,"MASCOT Score",28.1000000,,,,,,-1.2000000
EGYSQSQSRPVYGLSPTLNHR,ph,S,59,true,"Tissue atlas Arabidopsis - ProteomicsDB",114,32188942,"MaxQuant score",131.7800000,0.9963250,,,,1.489320037919E-22,
EGYSQSQSRPVYGLSPTLNHR,ph,S,61,true,"Tissue atlas Arabidopsis - ProteomicsDB",114,32188942,"MaxQuant score",148.8400000,0.8223740,,,,1.0366099448171E-25,
EGYSQSQSRPVYGLSPTLNHR,ph,S,70,true,"MAPK Arabidopsis substrates",45,23172892,"MaxQuant Score",176.1000000,,,,,,
EGYSQSQSRPVYGLSPTLNHR,ph,S,70,true,"Tissue atlas Arabidopsis - ProteomicsDB",114,32188942,"MaxQuant score",330.2600000,0.9972200,,,,0,
PVYGLSPTLNHR,ph,S,70,true,"atm and atr DNA damage response",88,25561503,"MASCOT Score",46.0000000,0.9890000,,,,,-0.1100000
EGYSQSQSRPVYGLSPTLNHR,ph,T,72,true,"MAPK Arabidopsis substrates",45,23172892,"MaxQuant Score",248.0600000,,,,,,
EGYSQSQSRPVYGLSPTLNHR,ph,T,72,true,"atm and atr DNA damage response",88,25561503,"MASCOT Score",40.0000000,0.9900000,,,,,0.2000000
EGYSQSQSRPVYGLSPTLNHR,ph,T,72,true,"TOR Kinase and ABA Receptor",100,29290610,XCorr,6.1013756,0.9996000,,,,3.0950000109442E-6,
PVYGLSPTLNHR,ph,T,72,true,"atm and atr DNA damage response",88,25561503,"MASCOT Score",75.0000000,1.0000000,,,,,0.1000000
PVYGLSPTLNHR,ph,T,72,true,"Tissue atlas Arabidopsis - ProteomicsDB",114,32188942,"MaxQuant score",345.8300000,0.9999950,,,,0,
GQSGLGTFLGQHK,ph,S,96,true,"Tissue atlas Arabidopsis - ProteomicsDB",114,32188942,"MaxQuant score",252.2000000,1.0000000,,,,0,
GQSGLGTFLGQHK,ph,T,100,true,"Tissue atlas Arabidopsis - ProteomicsDB",114,32188942,"MaxQuant score",186.6200000,1.0000000,,,,8.1631599102599E-22,
