Peptide,PTM,ModifiedAA,ModifiedPosition,PeptideUniqueToGene,ExperimentDesc,ExpID,PubmedID,ScoreType,IdentScore,LocProb,Log2FChange,PQ-val,QuantSig,PEP,MassErrorPPM
ASKRILKELKDLQKDPPTSCSAGPVAEDMF,nta,A,2,false,"Arabidopsis translation initiation landscape - NTA",167a,35069635,,,,,,,,
GSICLDILK,acy,C,85,false,"Arabidopsis S-acylation atlas - Hypocotyl",163b,35681017,,,,,,,,
ICLDILK,sno,C,85,false,"hot5-4 / wildtype, FAT-switch S-nitrosoproteome",169,37277371,,,,,,,,
VFHPNVNSNGSICLDILK,so,C,85,true,"S-sulfenylation site detection using YAP1C",110,32714340,,,,,,,,
SLLTDPNPDDPLVPE,nt,S,108,false,"Arg/N-end rule seed, prt6 vs. Wt",99,29168982,"MASCOT Score",40.5200000,,-0.3777762,0.4037237,NO,3.7879999581492E-5,-1.0784580
IAHMYKTDRAKYE,nt,I,123,false,"Arabidopsis translation initiation landscape - NT",167b,35069635,,,,,,,,
SWTQKYAMG,nta,S,140,false,"Arabidopsis translation initiation landscape - NTA",167a,35069635,,,,,,,,
SWTQKYAMG,ub,K,144,false,"upl3 mutant / wildtype",168,35926874,"MaxQuant score",55.1120000,1.0000000,-0.1456053,,,0.036049999296665,0.3079900
