Peptide,PTM,ModifiedAA,ModifiedPosition,PeptideUniqueToGene,ExperimentDesc,ExpID,PubmedID,ScoreType,IdentScore,LocProb,Log2FChange,PQ-val,QuantSig,PEP,MassErrorPPM
VATESVPDKAED,nta,V,79,true,"HUNTER N-terminome: legumain, GluC and trypsin",119,31951383,"MaxQuant score",42.0010000,,,,,,
VATESVPD,nta,V,79,true,"HUNTER N-terminome: legumain, GluC and trypsin",119,31951383,"MaxQuant score",118.0100000,,,,,,
MDAPKEIFLKNY,nta,M,93,true,"Arabidopsis translation initiation landscape - NTA",167a,35069635,,,,,,,,
GSSAALVLDGHDLK,ph,S,141,true,"Tissue atlas Arabidopsis - ProteomicsDB",114,32188942,"MaxQuant score",172.1000000,0.9639860,,,,7.9957602056025E-16,
GSSAALVLDGHDLKLLSVK,ub,K,152,true,"upl3 mutant / wildtype",168,35926874,"MaxQuant score",96.3790000,1.0000000,0.6516832,0.4199200,NO,9.1225402343298E-8,0.3606600
SRHLTLPSLPAEE,nt,S,172,true,"Arabidopsis translation initiation landscape - NT",167b,35069635,,,,,,,,
SSGNFCTQCEAEGFR,sno,C,213,true,"Site-specific nitrosomeproteomic id - gsnor1-3",90b,25699590,XCorr,2.0200000,,,,,0.0032130000181496,-7.4400000
SSGNFCTQCEAEGFR,sno,C,216,true,"Site-specific nitrosomeproteomic id - gsnor1-3",90a,25699590,XCorr,2.5716677,,,,,0.00012769999739248,-6.4165273
SNGNLISQGDIEGGRHY,nt,S,253,true,"Arabidopsis translation initiation landscape - NT",167b,35069635,,,,,,,,
VTCRDWFQLSLK,ox,C,406,true,"OxiTRAQ SA and flg22 responses - SA vs mock",91a,25720653,"MASCOT Score",29.5900000,,0.7398481,0.0000000,YES,,
VTCRDWFQLSLK,ox,C,406,true,"OxiTRAQ SA and flg22 responses - flg22 vs mock",91b,25720653,"MASCOT Score",29.5900000,,0.6040713,0.0000000,YES,,
IADVSKLR,ac,K,443,true,"Quantitative Acetylproteomics",101,29440448,,,,,,,,
MYKTLLGTQGFR,ac,K,492,true,"Quantitative Acetylproteomics",101,29440448,,,,,,,,
KGIDLYFER,me2,K,502,true,"Arabidopsis protein methylome",123,31809900,"MaxQuant Score",137.8900000,1.0000000,,,,1.0465000394033E-11,-0.1929600
HDEQAVTCEDFFAAMR,sno,C,518,true,"Site-specific nitrosomeproteomic id - gsnor1-3",90b,25699590,XCorr,3.7400000,,,,,9.5390001661144E-5,-4.9400000
SVHHDGTVQTISGSSTIL,nt,S,601,true,"Arabidopsis translation initiation landscape - NT",167b,35069635,,,,,,,,
DITLSSVHHDGTVQTISGSSTILR,ph,S,601,true,"Tissue atlas Arabidopsis - ProteomicsDB",114,32188942,"MaxQuant score",189.7800000,0.8196980,,,,0,
DITLSSVHHDGTVQTISGSSTILR,ph,T,607,true,"Tissue atlas Arabidopsis - ProteomicsDB",114,32188942,"MaxQuant score",292.8700000,0.9999850,,,,0,
SAPVRVETDLSNDDLFF,nt,S,645,true,"Arabidopsis translation initiation landscape - NT",167b,35069635,,,,,,,,
STEAYVFDHSNMAR,nt,S,773,true,"Arabidopsis translation initiation landscape - NT",167b,35069635,,,,,,,,
SLEDPAYME,nt,S,799,true,"Arg/N-end rule seed, prt6 vs. Wt",99,29168982,"MASCOT Score",38.4300000,,-0.9534125,0.1423044,NO,0.011760000139475,0.7416573
STSDIPGNVE,nt,S,863,true,"Arg/N-end rule seed, prt6 vs. Wt",99,29168982,"MASCOT Score",32.1200000,,-0.3440481,0.0472774,NO,0.00083079998148605,-1.1435101
WFLLQSTSDIPGNVENVKK,ub,K,875,true,"upl3 mutant / wildtype",168,35926874,"MaxQuant score",70.8020000,1.0000000,0.3651326,0.4817400,NO,3.1589799618814E-5,-1.2924000
