Peptide,PTM,ModifiedAA,ModifiedPosition,PeptideUniqueToGene,ExperimentDesc,ExpID,PubmedID,ScoreType,IdentScore,LocProb,Log2FChange,PQ-val,QuantSig,PEP,MassErrorPPM
RRDEIVSER,ph,S,51,true,"Tissue atlas Arabidopsis - ProteomicsDB",114,32188942,"MaxQuant score",123.2100000,1.0000000,,,,0.0020511799957603,
LPSRSPSPSTR,ph,S,61,true,"atm and atr DNA damage response",88,25561503,"MASCOT Score",25.0000000,1.0000000,,,,,0.0900000
LPSRSPSPSTR,ph,S,61,true,"Tissue atlas Arabidopsis - ProteomicsDB",114,32188942,"MaxQuant score",74.9660000,0.9996170,,,,0.0031792400404811,
LPSRSPSPSTR,ph,S,63,true,"atm and atr DNA damage response",88,25561503,"MASCOT Score",25.0000000,0.9940000,,,,,0.0900000
LPSRSPSPSTR,ph,S,63,true,"Tissue atlas Arabidopsis - ProteomicsDB",114,32188942,"MaxQuant score",74.9660000,0.9457960,,,,0.0031792400404811,
LPSRSPSPSTR,ph,S,65,true,"atm and atr DNA damage response",88,25561503,"MASCOT Score",25.0000000,0.9940000,,,,,0.0900000
LPSRSPSPSTR,ph,S,65,true,"Tissue atlas Arabidopsis - ProteomicsDB",114,32188942,"MaxQuant score",74.9660000,0.9243240,,,,0.0031792400404811,
SPAVPLPR,ph,S,80,true,"Tissue atlas Arabidopsis - ProteomicsDB",114,32188942,"MaxQuant score",74.3760000,1.0000000,,,,0.01144350040704,
TPVNISSR,ph,S,177,true,"Tissue atlas Arabidopsis - ProteomicsDB",114,32188942,"MaxQuant score",105.4000000,0.8437030,,,,0.0048298900946975,
ILSASPR,ph,S,206,true,"TOR Kinase and ABA Receptor",100,29290610,XCorr,2.1286952,0.9918000,,,,0.004311999771744,
ILSASPR,ph,S,206,true,"Phospho cell culture sucrose/TOR",109,30833711,,,0.8529550,,,,,
DLVLCSAPDSLLSSPSR,ph,S,234,true,"Tissue atlas Arabidopsis - ProteomicsDB",114,32188942,"MaxQuant score",183.7400000,0.9949730,,,,5.8043601432304E-30,
DLVLCSAPDSLLSSPSR,ph,S,237,true,"Tissue atlas Arabidopsis - ProteomicsDB",114,32188942,"MaxQuant score",221.4900000,0.8007460,,,,0,
DLVLCSAPDSLLSSPSR,ph,S,238,true,"Tissue atlas Arabidopsis - ProteomicsDB",114,32188942,"MaxQuant score",241.0800000,0.8478860,,,,0,
DLVLCSAPDSLLSSPSRSPMR,ph,S,242,true,"Tissue atlas Arabidopsis - ProteomicsDB",114,32188942,"MaxQuant score",194.2500000,0.9939400,,,,0,
CSPECSPVPSPR,ph,S,304,true,"atm and atr DNA damage response",88,25561503,"MASCOT Score",27.0000000,1.0000000,,,,,0.2800000
CSPECSPVPSPR,ph,S,308,true,"atm and atr DNA damage response",88,25561503,"MASCOT Score",27.0000000,1.0000000,,,,,0.2800000
CSPECSPVPSPR,ph,S,312,true,"atm and atr DNA damage response",88,25561503,"MASCOT Score",27.0000000,1.0000000,,,,,0.2800000
MTSPGPSSRIQSGAVTPLHPR,ph,S,317,true,"TOR Kinase and ABA Receptor",100,29290610,XCorr,4.1866374,0.8947000,,,,0.00013030000263825,
MTSPGPSSRIQSGAVTPLHPR,ph,S,321,true,"TOR Kinase and ABA Receptor",100,29290610,XCorr,4.1866374,0.9853000,,,,0.00013030000263825,
MTSPGPSSRIQSGAVTPLHPR,ph,S,326,true,"TOR Kinase and ABA Receptor",100,29290610,XCorr,4.1866374,0.9980000,,,,0.00013030000263825,
IQSGAVTPLHPR,ph,S,326,true,"atm and atr DNA damage response",88,25561503,"MASCOT Score",53.0000000,1.0000000,,,,,0.0500000
IQSGAVTPLHPR,ph,S,326,true,"Tissue atlas Arabidopsis - ProteomicsDB",114,32188942,"MaxQuant score",164.5600000,1.0000000,,,,1.4881000598432E-10,
IQSGAVTPLHPR,ph,T,330,true,"Large-scale phosphorylation discovery",44,23111157,XCorr,3.6880000,,,,,,
IQSGAVTPLHPR,ph,T,330,true,"atm and atr DNA damage response",88,25561503,"MASCOT Score",43.0000000,1.0000000,,,,,-0.1600000
IQSGAVTPLHPR,ph,T,330,true,"TOR Kinase and ABA Receptor",100,29290610,XCorr,2.4065251,0.9967000,,,,0.0028009999077767,
IQSGAVTPLHPR,ph,T,330,true,"Tissue atlas Arabidopsis - ProteomicsDB",114,32188942,"MaxQuant score",164.6600000,1.0000000,,,,3.8069000729557E-10,
AGGSTTGSPTRR,ph,S,343,true,"atm and atr DNA damage response",88,25561503,"MASCOT Score",24.0000000,0.9760000,,,,,0.0900000
AGGSTTGSPTRRLDDNR,fuc,T,345,true,"SPINDLY O-fucosylation",162,36739885,,,,,,,-1.5,
AEATVSPGSR,ph,S,395,true,"atm and atr DNA damage response",88,25561503,"MASCOT Score",55.0000000,1.0000000,,,,,-0.9800000
AEATVSPGSR,ph,S,395,true,"Tissue atlas Arabidopsis - ProteomicsDB",114,32188942,"MaxQuant score",106.6700000,0.9551730,,,,0.00024591598776169,
HITAQSGPLSFK,ph,S,554,true,"Tissue atlas Arabidopsis - ProteomicsDB",114,32188942,"MaxQuant score",182.3700000,0.9996710,,,,8.8968302587239E-20,
HITAQSGPLSFK,ph,S,558,true,"atm and atr DNA damage response",88,25561503,"MASCOT Score",38.0000000,1.0000000,,,,,-0.0200000
HITAQSGPLSFK,ph,S,558,true,"Tissue atlas Arabidopsis - ProteomicsDB",114,32188942,"MaxQuant score",219.9500000,1.0000000,,,,0,
SLPCLDSEDATNYQQK,ph,S,692,true,"Tissue atlas Arabidopsis - ProteomicsDB",114,32188942,"MaxQuant score",184.4400000,1.0000000,,,,1.1247000237286E-26,
HGSGFSISQSPR,ph,S,713,true,"Tissue atlas Arabidopsis - ProteomicsDB",114,32188942,"MaxQuant score",94.2870000,0.9989010,,,,0.00020881500677206,
HGSGFSISQSPR,ph,S,716,true,"atm and atr DNA damage response",88,25561503,"MASCOT Score",45.0000000,1.0000000,,,,,0.1900000
HGSGFSISQSPR,ph,S,716,true,"Lateral root-induction - NAA vs control",106,23328941,"MASCOT Score",33.0000000,,,,,,
HGSGFSISQSPR,ph,S,716,true,"Tissue atlas Arabidopsis - ProteomicsDB",114,32188942,"MaxQuant score",157.4300000,0.9994090,,,,9.1168500526706E-10,
HGSGFSISQSPR,ph,S,718,true,"Tissue atlas Arabidopsis - ProteomicsDB",114,32188942,"MaxQuant score",132.0000000,0.7772710,,,,3.4405598853482E-5,
HGSGFSISQSPR,ph,S,720,true,"srk2dei ABA signaling phopshoproteomics",83,23572148,"MASCOT Score",40.0000000,,,,,,-0.0001000
HGSGFSISQSPR,ph,S,720,true,"atm and atr DNA damage response",88,25561503,"MASCOT Score",48.0000000,1.0000000,,,,,-0.1400000
HGSGFSISQSPR,ph,S,720,true,"TOR Kinase and ABA Receptor",100,29290610,XCorr,3.1964757,0.9924000,,,,0.0077030002139509,
HGSGFSISQSPR,ph,S,720,true,"Tissue atlas Arabidopsis - ProteomicsDB",114,32188942,"MaxQuant score",281.6000000,1.0000000,,,,0,
NMSCPISPVGSPIFHSHSPHISGR,ph,S,725,true,"Tissue atlas Arabidopsis - ProteomicsDB",114,32188942,"MaxQuant score",199.0400000,1.0000000,,,,0,
NMSCPISPVGSPIFHSHSPHISGR,ph,S,729,true,"Tissue atlas Arabidopsis - ProteomicsDB",114,32188942,"MaxQuant score",199.0400000,0.9999970,,,,0,
NMSCPISPVGSPIFHSHSPHISGR,ph,S,733,true,"Tissue atlas Arabidopsis - ProteomicsDB",114,32188942,"MaxQuant score",65.1410000,0.9873280,,,,1.4149200069369E-5,
RSPSPISSPHALSGSSTPLTGCGGAIPFHHQR,ph,S,748,true,"Tissue atlas Arabidopsis - ProteomicsDB",114,32188942,"MaxQuant score",64.5320000,0.7650790,,,,6.5647796532176E-8,
RSPSPISSPHALSGSSTPLTGCGGAIPFHHQR,ph,S,750,true,"Tissue atlas Arabidopsis - ProteomicsDB",114,32188942,"MaxQuant score",211.1100000,0.8916700,,,,0,
QTTVNFLHEGIGSSR,ph,T,781,true,"atm and atr DNA damage response",88,25561503,"MASCOT Score",26.0000000,0.9950000,,,,,-1.8500000
SPGSGGNFYTNSFFQEPSR,ph,S,794,true,"Tissue atlas Arabidopsis - ProteomicsDB",114,32188942,"MaxQuant score",347.2400000,0.9999910,,,,0,
SPGSGGNFYTNSFFQEPSR,ph,S,805,true,"Tissue atlas Arabidopsis - ProteomicsDB",114,32188942,"MaxQuant score",207.4000000,0.9981470,,,,0,
TPPHVFWDNNGSIQPGYNWNK,ph,T,823,true,"Tissue atlas Arabidopsis - ProteomicsDB",114,32188942,"MaxQuant score",73.8650000,0.9998960,,,,9.5353598226211E-6,
SLDLRPGFSTPGSTNRGP,ph,S,874,true,"TOR Kinase and ABA Receptor",100,29290610,XCorr,2.4956217,0.9891000,,,,0.01630000025034,
SLDLRPGFSTPGSTNR,ph,T,875,true,"Tissue atlas Arabidopsis - ProteomicsDB",114,32188942,"MaxQuant score",141.3600000,0.9819460,,,,3.984809993085E-8,
