Peptide,PTM,ModifiedAA,ModifiedPosition,PeptideUniqueToGene,ExperimentDesc,ExpID,PubmedID,ScoreType,IdentScore,LocProb,Log2FChange,PQ-val,QuantSig,PEP,MassErrorPPM
AGPARRNSYPNPADDDPPEAPE,nt,A,42,true,"HUNTER N-terminome: legumain, GluC and trypsin",119,31951383,"MaxQuant score",75.5330000,,,,,,
AGPARRNSYPNPADDDPPEAPE,nt,A,42,true,"Arabidopsis translation initiation landscape - NT",167b,35069635,,,,,,,,
GPARRNSYPNPADDDPPEAPE,nt,G,43,true,"HUNTER N-terminome: legumain, GluC and trypsin",119,31951383,"MaxQuant score",56.5400000,,,,,,
DDEESGGDLFSDIDR,ph,S,117,true,"Tissue atlas Arabidopsis - ProteomicsDB",114,32188942,"MaxQuant score",220.4600000,1.0000000,,,,0,
NTYLSAIADVEDAAETGRDDEESGGDLFSDIDR,ph,S,123,true,"TOR Kinase and ABA Receptor",100,29290610,XCorr,5.1093969,0.8320000,,,,0.00058330001775175,
KIGEEGNEEEGDVTDDVDELDEEEVVDLDEIDK,ph,T,167,true,"SnRK2 protein kinase substrates",85,23776212,XCorr,4.8268561,1.0000000,,,,3.8199599039501E-10,
KIGEEGNEEEGDVTDDVDELDEEEVVDLDEIDK,ph,T,167,true,"TOR Kinase and ABA Receptor",100,29290610,XCorr,7.0263362,1.0000000,,,,7.0680002295376E-8,
IGEEGNEEEGDVTDDVDELDEEEVVDLDEIDK,ph,T,167,true,"SnRK2 protein kinase substrates",85,23776212,XCorr,4.8363061,1.0000000,,,,5.5677497812212E-7,
IGEEGNEEEGDVTDDVDELDEEEVVDLDEIDK,ph,T,167,true,"TOR Kinase and ABA Receptor",100,29290610,XCorr,5.1861954,1.0000000,,,,2.1960000594845E-5,
LTGLTEISDEEDWVDEEGNTR,ph,S,194,true,"srk2dei ABA signaling phopshoproteomics",83,23572148,"MASCOT Score",99.0000000,,,,,,-0.0022000
LTGLTEISDEEDWVDEEGNTR,ph,S,194,true,"LAXIC - mannitol vs control",84b,23660473,XCorr,5.5500000,1.0000000,,,,0.00056356599088758,
LTGLTEISDEEDWVDEEGNTR,ph,S,194,true,"SnRK2 protein kinase substrates",85,23776212,XCorr,4.9917579,1.0000000,,,,1.4837100437148E-9,
LTGLTEISDEEDWVDEEGNTR,ph,S,194,true,"TOR Kinase and ABA Receptor",100,29290610,XCorr,5.9615283,0.9990000,,,,7.9630000371367E-9,
LTGLTEISDEEDWVDEEGNTR,ph,S,194,true,"Phospho cell culture sucrose/TOR",109,30833711,,,0.9999970,,,,,
LTGLTEISDEEDWVDEEGNTR,ph,S,194,true,"Tissue atlas Arabidopsis - ProteomicsDB",114,32188942,"MaxQuant score",588.0800000,1.0000000,,,,0,
EIDIEDTLGCR,ox,C,316,true,"SPEAR - 50 mM H2O2 / mock",138b,34619326,,,,-0.5568242,0.0292102,YES,,
IITVIGCEGENER,sno,C,624,true,"hot5-4 / wildtype, FAT-switch S-nitrosoproteome",169,37277371,,,,0.2244528,0.1576420,NO,,
