Peptide,PTM,ModifiedAA,ModifiedPosition,PeptideUniqueToGene,ExperimentDesc,ExpID,PubmedID,ScoreType,IdentScore,LocProb,Log2FChange,PQ-val,QuantSig,PEP,MassErrorPPM
SSHLSQDANMNGVYVR,ph,S,3,true,"Tissue atlas Arabidopsis - ProteomicsDB",114,32188942,"MaxQuant score",128.7400000,0.7645390,,,,2.6220499549368E-8,
SDVSSMLSFDGSESR,ph,S,25,true,"Tissue atlas Arabidopsis - ProteomicsDB",114,32188942,"MaxQuant score",163.7100000,0.9884800,,,,8.0760501368002E-13,
FEVSDIEQGDMVPVLQSLK,ph,S,120,true,"Phosphorylation in N starvation",63,22060019,"MASCOT Score",99.0000000,,,,,,
ASFSDGSYDKNSLAAR,ph,S,145,true,"Tissue atlas Arabidopsis - ProteomicsDB",114,32188942,"MaxQuant score",106.3100000,0.9996650,,,,1.5728300013507E-6,
RRWSLPEDHSDSR,ph,S,158,true,"TOR Kinase and ABA Receptor",100,29290610,XCorr,2.3847301,0.9997000,,,,0.017039999365807,
RWSLPEDHSDSR,ph,S,158,true,"atm and atr DNA damage response",88,25561503,"MASCOT Score",44.0000000,1.0000000,,,,,1.0700000
RWSLPEDHSDSR,ph,S,158,true,"Phospho cell culture sucrose/TOR",109,30833711,,,0.9999960,,,,,
RWSLPEDHSDSR,ph,S,158,true,"Tissue atlas Arabidopsis - ProteomicsDB",114,32188942,"MaxQuant score",189.4500000,1.0000000,,,,2.7114800240549E-22,
EGSEIDMSDAK,ph,S,183,true,"Tissue atlas Arabidopsis - ProteomicsDB",114,32188942,"MaxQuant score",85.6720000,1.0000000,,,,0.0010366500355303,
ERSEEKDVVR,ph,S,309,true,"Tissue atlas Arabidopsis - ProteomicsDB",114,32188942,"MaxQuant score",127.3000000,1.0000000,,,,2.1886200556764E-5,
DILSDGGSSR,ph,S,623,true,"Tissue atlas Arabidopsis - ProteomicsDB",114,32188942,"MaxQuant score",101.7200000,0.8916560,,,,5.5511998652946E-5,
QLMEQVSNLKDVIAK,ph,S,822,true,"Tissue atlas Arabidopsis - ProteomicsDB",114,32188942,"MaxQuant score",103.6600000,1.0000000,,,,3.8254997889453E-6,
RGLSNLR,ph,S,854,true,"srk2dei ABA signaling phopshoproteomics",83,23572148,"MASCOT Score",52.0000000,,,,,,0.0000000
RGLSNLR,ph,S,854,true,"Phospho cell culture sucrose/TOR",109,30833711,,,1.0000000,,,,,
RGLSNLR,ph,S,854,true,"Tissue atlas Arabidopsis - ProteomicsDB",114,32188942,"MaxQuant score",97.5970000,1.0000000,,,,0.015947699546814,
LVGPTSPR,ph,T,862,true,"Lateral root-induction - NAA vs control",106,23328941,"MASCOT Score",34.0000000,,,,,,
LVGPTSPR,ph,T,862,true,"Phospho cell culture sucrose/TOR",109,30833711,,,0.7679340,,,,,
LVGPTSPR,ph,T,862,true,"Tissue atlas Arabidopsis - ProteomicsDB",114,32188942,"MaxQuant score",97.2840000,0.7715730,,,,0.007190799806267,
LVGPTSPR,ph,S,863,true,"Large-scale phosphorylation discovery",44,23111157,XCorr,2.2090000,,,,,,
LVGPTSPR,ph,S,863,true,"Chloroplast kinase substrates",60,19376835,"MASCOT Score",32.7300000,,,,,,-0.5547210
LVGPTSPR,ph,S,863,true,"atm and atr DNA damage response",88,25561503,"MASCOT Score",26.0000000,0.9960000,,,,,-0.1200000
LVGPTSPR,ph,S,863,true,"Phospho cell culture sucrose/TOR",109,30833711,,,0.9726260,,,,,
LVGPTSPR,ph,S,863,true,"Col-0 callus - FC Col-0 vs. Col-0 Xray",111a,31410901,,44.2400000,,-0.8796402,0.0000000,NO,,-0.0779601
LVGPTSPR,ph,S,863,true,"Col-0 X-ray callus - FC Col-0 vs. Col-0 Xray",111b,31410901,,44.2400000,,-0.8796402,0.0000000,NO,,-0.0779601
LVGPTSPR,ph,S,863,true,"atm callus - FC atm vs. atm Xray",111c,31410901,,44.2400000,,-0.5207838,0.0000000,NO,,-0.0779601
LVGPTSPR,ph,S,863,true,"atm-3 X-ray callus - FC atm vs. atm Xray",111d,31410901,,44.2400000,,-0.5207838,0.0000000,NO,,-0.0779601
LVGPTSPR,ph,S,863,true,"Tissue atlas Arabidopsis - ProteomicsDB",114,32188942,"MaxQuant score",139.4300000,0.9759490,,,,0.00023904099361971,
LVGPTSPRRHSIGASPNAR,ph,S,868,true,"Brassinosteroid-Regulated Phosphorylation Dynamics",94,26187819,"MaxQuant Score",45.6180000,0.8250000,,,,0.0489999987185,0.6820000
RHSIGASPNAR,ph,S,868,true,"atm and atr DNA damage response",88,25561503,"MASCOT Score",54.0000000,1.0000000,,,,,1.0000000
RHSIGASPNAR,ph,S,868,true,"TOR Kinase and ABA Receptor",100,29290610,XCorr,3.1589139,1.0000000,,,,0.079250000417233,
RHSIGASPNAR,ph,S,868,true,"Phospho cell culture sucrose/TOR",109,30833711,,,1.0000000,,,,,
RHSIGASPNAR,ph,S,868,true,"Tissue atlas Arabidopsis - ProteomicsDB",114,32188942,"MaxQuant score",129.0100000,1.0000000,,,,1.3300200407684E-6,
RHSIGASPNAR,ph,S,872,true,"atm and atr DNA damage response",88,25561503,"MASCOT Score",54.0000000,1.0000000,,,,,1.0000000
RHSIGASPNAR,ph,S,872,true,"TOR Kinase and ABA Receptor",100,29290610,XCorr,4.1104164,1.0000000,,,,5.4619999900751E-6,
RHSIGASPNAR,ph,S,872,true,"Tissue atlas Arabidopsis - ProteomicsDB",114,32188942,"MaxQuant score",179.6000000,1.0000000,,,,1.3157700484712E-9,
HSIGASPNAR,ph,S,872,true,"atm and atr DNA damage response",88,25561503,"MASCOT Score",30.0000000,0.9990000,,,,,-0.0500000
HSIGASPNAR,ph,S,872,true,"TOR Kinase and ABA Receptor",100,29290610,XCorr,3.2298284,1.0000000,,,,0.00024389999452978,
GTSDVDNCSEYSSK,ph,S,889,true,"Tissue atlas Arabidopsis - ProteomicsDB",114,32188942,"MaxQuant score",135.1400000,0.9865280,,,,3.7115199802429E-9,
GTSDVDNCSEYSSK,ph,S,898,true,"Tissue atlas Arabidopsis - ProteomicsDB",114,32188942,"MaxQuant score",232.2600000,0.9090440,,,,0,
DYHQPSKFAGAAK,ph,S,923,true,"Tissue atlas Arabidopsis - ProteomicsDB",114,32188942,"MaxQuant score",76.5860000,0.9999970,,,,0.00035172898788005,
PSRLSIATSSSSK,ph,S,1040,true,"Tissue atlas Arabidopsis - ProteomicsDB",114,32188942,"MaxQuant score",71.4020000,0.9660670,,,,0.0012931099627167,
LSIATSSSSK,ph,T,1043,true,"atm and atr DNA damage response",88,25561503,"MASCOT Score",21.0000000,0.9750000,,,,,-1.8400000
LSIATSSSSK,ph,S,1044,true,"Tissue atlas Arabidopsis - ProteomicsDB",114,32188942,"MaxQuant score",166.1400000,0.8406480,,,,2.7289098625261E-7,
LSIATSSSSK,ph,S,1045,true,"Tissue atlas Arabidopsis - ProteomicsDB",114,32188942,"MaxQuant score",173.7600000,0.9465490,,,,9.4967198549512E-8,
LSIATSSSSK,ph,S,1047,true,"atm and atr DNA damage response",88,25561503,"MASCOT Score",54.0000000,0.9540000,,,,,-1.3700000
LSIATSSSSK,ph,S,1047,true,"TOR Kinase and ABA Receptor",100,29290610,XCorr,2.7373571,0.9957000,,,,0.029060000553727,
