Peptide,PTM,ModifiedAA,ModifiedPosition,PeptideUniqueToGene,ExperimentDesc,ExpID,PubmedID,ScoreType,IdentScore,LocProb,Log2FChange,PQ-val,QuantSig,PEP,MassErrorPPM
GCEVSK,myr,G,2,false,"N-Terminal Myristoylated Proteins",102,29453228,,,,,,,,
LCAFCCVSDPEGSNHGVTGLDEDR,ph,S,20,true,"Phospho cell culture sucrose/TOR",109,30833711,,,0.9759060,,,,,
LCAFCCVSDPEGSNHGVTGLDEDR,ph,S,20,true,"Tissue atlas Arabidopsis - ProteomicsDB",114,32188942,"MaxQuant score",153.0600000,0.9973690,,,,2.5223372357847E-44,
NATSGFATENIVSEHGEKAPNVVYK,ac,K,68,true,"Histone deacetylases- hda14 vs WT (low light)",98c,29061669,"MaxQuant Score",152.2300000,1.0000000,-0.2980000,0.9885531,NO,8.2000002309158E-17,
APNVVYKGK,ub,K,75,false,"upl3 mutant / wildtype",168,35926874,"MaxQuant score",47.9600000,1.0000000,,,,0.012799800373614,1.1187000
QFLEEAKAVGQLR,ub,K,105,false,"Ubiquitination Membrane Proteins",120,33585938,,,,,,,,
QFLEEAKAVGQLR,ub,K,105,false,"upl3 mutant / wildtype",168,35926874,"MaxQuant score",81.5650000,1.0000000,-0.2933589,,,0.00015471900405828,2.8725000
DGKSYSTNLAFTPPEYLR,ph,S,211,false,"Tissue atlas Arabidopsis - ProteomicsDB",114,32188942,"MaxQuant score",83.4180000,0.9995560,,,,0.00021839499822818,
DGKSYSTNLAFTPPEYLR,ph,Y,212,false,"Large-scale phosphorylation discovery",44,23111157,XCorr,3.2890000,,,,,,
SYSTNLAFTPPEYLR,ph,S,213,false,"Arabidopsis root NAA phosphoproteome",18a,27643528,"MaxQuant Score",87.6680000,0.8830000,,,,1.0880000012037E-8,0.2420000
SYSTNLAFTPPEYLR,ph,S,213,false,"Sucrose-induced phosphorylation",24,17586839,,,,,,,,
SYSTNLAFTPPEYLR,ph,S,213,false,"Plasmembrane Ph Immune Responses",25,17651370,,,,,,,,
SYSTNLAFTPPEYLR,ph,S,213,false,"Brassinosteroid-Regulated Phosphorylation Dynamics",94,26187819,"MaxQuant Score",150.2300000,0.9630000,,,,5.0109997531619E-13,0.8510000
SYSTNLAFTPPEYLR,ph,S,213,false,"Phospho cell culture sucrose/TOR",109,30833711,,,0.8286590,,,,,
SYSTNLAFTPPEYLR,ph,S,213,false,"Tissue atlas Arabidopsis - ProteomicsDB",114,32188942,"MaxQuant score",305.2900000,0.9997530,,,,0,
CLQYEPR,sno,C,292,false,"hot5-4 / wildtype, FAT-switch S-nitrosoproteome",169,37277371,,,,,,,,
ERPNPKSLVTAMIPLQK,ac,K,304,true,"Quantitative Acetylproteomics",101,29440448,,,,,,,,
