Peptide,PTM,ModifiedAA,ModifiedPosition,PeptideUniqueToGene,ExperimentDesc,ExpID,PubmedID,ScoreType,IdentScore,LocProb,Log2FChange,PQ-val,QuantSig,PEP,MassErrorPPM
SRDSSPMSDPNEPK,ph,S,117,true,"TOR Kinase and ABA Receptor",100,29290610,XCorr,3.9189889,0.9794000,,,,0.00040310001350008,
KYGEPMVSNKSR,ph,S,117,true,"atm and atr DNA damage response",88,25561503,"MASCOT Score",32.0000000,1.0000000,,,,,-1.2200000
KYGEPMVSNKSR,ph,S,117,true,"Tissue atlas Arabidopsis - ProteomicsDB",114,32188942,"MaxQuant score",163.9100000,0.9991410,,,,7.3350298057662E-11,
SRDSSPMSDPNEPKR,ph,S,120,true,"Tissue atlas Arabidopsis - ProteomicsDB",114,32188942,"MaxQuant score",92.3800000,0.8273650,,,,0.00017569700139575,
SRDSSPMSDPNEPK,ph,S,120,true,"atm and atr DNA damage response",88,25561503,"MASCOT Score",23.0000000,1.0000000,,,,,0.1300000
SRDSSPMSDPNEPK,ph,S,121,true,"atm and atr DNA damage response",88,25561503,"MASCOT Score",29.0000000,0.9960000,,,,,-0.3200000
SRDSSPMSDPNEPK,ph,S,121,true,"TOR Kinase and ABA Receptor",100,29290610,XCorr,3.3889596,0.9833000,,,,0.003880999982357,
DSSPMSDPNEPKR,ph,S,121,true,"atm and atr DNA damage response",88,25561503,"MASCOT Score",38.0000000,0.9930000,,,,,0.4000000
DSSPMSDPNEPKR,ph,S,121,true,"Tissue atlas Arabidopsis - ProteomicsDB",114,32188942,"MaxQuant score",172.5800000,0.9996340,,,,1.1652600491642E-15,
DSSPMSDPNEPK,ph,S,121,true,"atm and atr DNA damage response",88,25561503,"MASCOT Score",48.0000000,0.9970000,,,,,-0.1200000
DSSPMSDPNEPK,ph,S,121,true,"Phospho cell culture sucrose/TOR",109,30833711,,,0.9830140,,,,,
SRDSSPMSDPNEPK,ph,S,124,true,"atm and atr DNA damage response",88,25561503,"MASCOT Score",23.0000000,1.0000000,,,,,0.1300000
SRDSSPMSDPNEPK,ph,S,124,true,"TOR Kinase and ABA Receptor",100,29290610,XCorr,3.9189889,0.8303000,,,,0.00040310001350008,
DSSPMSDPNEPKR,ph,S,124,true,"atm and atr DNA damage response",88,25561503,"MASCOT Score",38.0000000,1.0000000,,,,,0.4000000
DSSPMSDPNEPKR,ph,S,124,true,"Tissue atlas Arabidopsis - ProteomicsDB",114,32188942,"MaxQuant score",149.0900000,1.0000000,,,,3.7585999734802E-7,
DSSPMSDPNEPK,ph,S,124,true,"atm and atr DNA damage response",88,25561503,"MASCOT Score",48.0000000,1.0000000,,,,,-0.1200000
GWPGSGSGSGR,ph,S,340,true,"Tissue atlas Arabidopsis - ProteomicsDB",114,32188942,"MaxQuant score",84.1690000,0.7848510,,,,0.00076517200795934,
GWPGSGSGSGR,ph,S,342,true,"atm and atr DNA damage response",88,25561503,"MASCOT Score",41.0000000,0.9950000,,,,,0.3900000
GWPGSGSGSGR,ph,S,342,true,"Tissue atlas Arabidopsis - ProteomicsDB",114,32188942,"MaxQuant score",96.7450000,0.8397050,,,,0.00010769700020319,
NPLTDFDLTRG,ph,T,359,true,"Tissue atlas Arabidopsis - ProteomicsDB",114,32188942,"MaxQuant score",147.6600000,1.0000000,,,,6.7982199425387E-8,
