Peptide,PTM,ModifiedAA,ModifiedPosition,PeptideUniqueToGene,ExperimentDesc,ExpID,PubmedID,ScoreType,IdentScore,LocProb,Log2FChange,PQ-val,QuantSig,PEP,MassErrorPPM
AAAEAEAKR,nt,A,81,true,"N-terminal ChaFRADIC",92,26010716,"MASCOT Score",20.5000000,,,,,0.00011510000331327,
AAEAEAKR,nt,A,82,true,"Arabidopsis translation initiation landscape - NT",167b,35069635,,,,,,,,
ICFVNK,so,C,218,true,"S-sulfenylation site detection using YAP1C",110,32714340,,,,,,,,
FVPILCGSAFK,so,C,345,true,"S-sulfenylation site detection using YAP1C",110,32714340,,,,,,,,
SDPENPVVL,nt,S,477,true,"N-terminal ChaFRADIC",92,26010716,"MASCOT Score",29.7800000,,,,,0.039289999753237,
MATGLIK,mox,M,510,true,"cat2 Methionine oxidation - 1h stress",62a,25693801,"MASCOT Score",40.0000000,,0.0820657,,NO,,
MATGLIK,mox,M,510,true,"cat2 Methionine oxidation - 3h stress",62b,25693801,"MASCOT Score",43.0000000,,-0.0355421,,NO,,
LAQEDPSFHFSR,ph,S,523,true,"Tissue atlas Arabidopsis - ProteomicsDB",114,32188942,"MaxQuant score",77.7460000,0.9974800,,,,0.00049142999341711,
GGAVPREYIPGVMK,mox,M,629,true,"cat2 Methionine oxidation - 3h stress",62b,25693801,"MASCOT Score",37.0000000,,-0.3738838,,NO,,
GRASYTMQLAK,mox,M,758,true,"cat2 Methionine oxidation - 1h stress",62a,25693801,"MASCOT Score",41.0000000,,0.0323930,,NO,,
