Peptide,PTM,ModifiedAA,ModifiedPosition,PeptideUniqueToGene,ExperimentDesc,ExpID,PubmedID,ScoreType,IdentScore,LocProb,Log2FChange,PQ-val,QuantSig,PEP,MassErrorPPM
ADEAKAKGNAAFSSGDFNSAVNHFTDAINLTPTNHVLF,nta,A,2,true,"Arg/N-end rule pathway Roots",80,25728785,"MASCOT Score",45.6000000,,,,,4.0569998418505E-6,
ADEAKAKGNAAF,nta,A,2,true,"Arabidopsis translation initiation landscape - NTA",167a,35069635,,,,,,,,
ADEAKAK,ac,K,6,true,"Quantitative Acetylproteomics",101,29440448,,,,,,,,
EIQRNPSNLNLYLQDQR,ph,S,168,true,"srk2dei ABA signaling phopshoproteomics",83,23572148,"MASCOT Score",41.0000000,,,,,,-0.0004000
NPSNLNLYLQDQR,ph,S,168,true,"Tyrosine phosphorylation in Arabidopsis",59,18463617,"MASCOT Score",57.0000000,,,,,,-1.1489045
NPSNLNLYLQDQR,ph,S,168,true,"srk2dei ABA signaling phopshoproteomics",83,23572148,"MASCOT Score",56.0000000,,,,,,0.0008000
NPSNLNLYLQDQR,ph,S,168,true,"SnRK2 protein kinase substrates",85,23776212,XCorr,2.0955243,1.0000000,,,,0.015220900066197,
NPSNLNLYLQDQR,ph,S,168,true,"atm and atr DNA damage response",88,25561503,"MASCOT Score",95.0000000,1.0000000,,,,,-0.3700000
NPSNLNLYLQDQR,ph,S,168,true,"Phospho cell culture sucrose/TOR",109,30833711,,,1.0000000,,,,,
NPSNLNLYLQDQR,ph,S,168,true,"Col-0 callus - FC Col-0 vs. Col-0 Xray",111a,31410901,,75.8100000,,1.1612125,0.0000000,NO,,1.0661608
NPSNLNLYLQDQR,ph,S,168,true,"Col-0 X-ray callus - FC Col-0 vs. Col-0 Xray",111b,31410901,,75.8100000,,1.1612125,0.0000000,NO,,1.0661608
NPSNLNLYLQDQR,ph,S,168,true,"atm callus - FC atm vs. atm Xray",111c,31410901,,75.8100000,,0.5470151,0.0000000,NO,,1.0661608
NPSNLNLYLQDQR,ph,S,168,true,"atm-3 X-ray callus - FC atm vs. atm Xray",111d,31410901,,75.8100000,,0.5470151,0.0000000,NO,,1.0661608
NPSNLNLYLQDQR,ph,S,168,true,"Tissue atlas Arabidopsis - ProteomicsDB",114,32188942,"MaxQuant score",394.7900000,1.0000000,,,,0,
QAGDDMEIGEEEMAVPSR,nt,Q,195,true,"Arabidopsis translation initiation landscape - NT",167b,35069635,,,,,,,,
KEPEVEKKR,ub,K,213,true,"Arabidopsis ubiquitination COFRADIC",40,26744219,"MaxQuant Score",140.4900000,1.0000000,,,,3.4699999105214E-6,-0.0980000
KEPEVEKKR,ub,K,219,true,"Arabidopsis ubiquitination COFRADIC",40,26744219,"MaxQuant Score",140.4900000,1.0000000,,,,3.4699999105214E-6,-0.0980000
KEPEVEKKR,ub,K,220,true,"Arabidopsis ubiquitination COFRADIC",40,26744219,"MaxQuant Score",140.4900000,1.0000000,,,,3.4699999105214E-6,-0.0980000
AAVHLEMGKYDECIK,sno,C,296,true,"Site-specific nitrosomeproteomic id - gsnor1-3",90a,25699590,XCorr,2.7600000,,,,,0.1427000015974,-6.7200000
SDYKMVAKALTR,nt,S,312,true,"Arabidopsis translation initiation landscape - NT",167b,35069635,,,,,,,,
SDYKMVAKALTR,ub,K,319,true,"Arabidopsis ubiquitination COFRADIC",40,26744219,"MaxQuant Score",55.7240000,1.0000000,,,,0.0010000000474975,0.0240000
NPETLKR,ub,K,359,true,"Arabidopsis ubiquitination COFRADIC",40,26744219,"MaxQuant Score",117.1600000,1.0000000,,,,0.0070000002160668,-0.5560000
EKGNDFFKEQKYPDAVR,ub,K,388,true,"Arabidopsis ubiquitination COFRADIC",40,26744219,"MaxQuant Score",90.3850000,0.9980000,,,,3.6389999086978E-14,-0.3000000
TEAIKRNPKDPRAY,nt,T,406,true,"Arabidopsis translation initiation landscape - NT",167b,35069635,,,,,,,,
HYTEAIKR,ac,K,410,false,"Quantitative Acetylproteomics",101,29440448,,,,,,,,
HYTEAIKR,ub,K,410,false,"Arabidopsis ubiquitination COFRADIC",40,26744219,"MaxQuant Score",83.2060000,1.0000000,,,,0.016000000759959,0.5690000
AACYTK,so,C,425,false,"S-sulfenylation site detection using YAP1C",110,32714340,,,,,,,,
LGAMPEGLK,mox,M,432,false,"cat2 Methionine oxidation - 1h stress",62a,25693801,"MASCOT Score",38.0000000,,0.4451516,,NO,,
CIELDPTFLK,sno,C,442,true,"Site-specific nitrosomeproteomic id - gsnor1-3",90a,25699590,XCorr,3.1290016,,,,,0.00085200002649799,-7.0169542
DAEKCIELDPTFLK,so,C,442,true,"Arabidopsis S-sulfenylation chemoproteomics",108,31578252,"pFind PSM Score",0.2117780,,1.2820500,,,,-1.7644514
CIELDPTFLK,so,C,442,true,"S-sulfenylation site detection using YAP1C",110,32714340,,,,,,,,
GAVQFFMK,mox,M,463,true,"cat2 Methionine oxidation - 1h stress",62a,25693801,"MASCOT Score",37.0000000,,-0.0473779,,NO,,
GAVQFFMK,mox,M,463,true,"cat2 Methionine oxidation - 3h stress",62b,25693801,"MASCOT Score",33.0000000,,1.8964992,,NO,,
CVQQINK,ox,C,493,false,"OxiTRAQ Arabidopsis - 5 mM H2O2 versus control",47,24376095,,,,-0.1168974,0.4887035,NO,,
RCVQQINK,so,C,493,false,"Arabidopsis S-sulfenylation chemoproteomics",108,31578252,"pFind PSM Score",0.0609182,,1.9005700,,,,1.1289087
CVQQINKANR,ub,K,499,false,"Arabidopsis ubiquitination COFRADIC",40,26744219,"MaxQuant Score",113.6200000,1.0000000,,,,5.4729998737457E-6,0.7470000
ANRGDLTPEELK,ph,T,506,false,"TOR Kinase and ABA Receptor",100,29290610,XCorr,3.4224150,1.0000000,,,,0.0030809999443591,
GDLTPEELKER,ph,T,506,false,"Ethylene-regulated phosphorylation ein2 mutant",30,19253305,"MASCOT Score",26.9841000,,,,,,11.2629330
GDLTPEELKER,ph,T,506,false,"Pollen phosphoproteome Arabidopsis",43,22631563,"MASCOT Score",54.2500000,,,,,,
GDLTPEELKER,ph,T,506,false,"Phosphoproteome ethylene-regulated time response",46,24043427,"MASCOT Score",57.4900000,,,,,,1.2303000
GDLTPEELKER,ph,T,506,false,"SnRK2 protein kinase substrates",85,23776212,XCorr,2.2487879,1.0000000,,,,0.0051128999330103,
GDLTPEELKER,ph,T,506,false,"atm and atr DNA damage response",88,25561503,"MASCOT Score",44.0000000,1.0000000,,,,,-0.2200000
GDLTPEELKER,ph,T,506,false,"Phospho cell culture sucrose/TOR",109,30833711,,,1.0000000,,,,,
GDLTPEELKER,ph,T,506,false,"Col-0 callus - FC Col-0 vs. Col-0 Xray",111a,31410901,,32.3900000,,0.0789791,0.0000000,NO,,0.5740936
GDLTPEELKER,ph,T,506,false,"Col-0 X-ray callus - FC Col-0 vs. Col-0 Xray",111b,31410901,,32.3900000,,0.0789791,0.0000000,NO,,0.5740936
GDLTPEELKER,ph,T,506,false,"atm callus - FC atm vs. atm Xray",111c,31410901,,32.3900000,,-0.9355455,0.0000000,NO,,0.5740936
GDLTPEELKER,ph,T,506,false,"atm-3 X-ray callus - FC atm vs. atm Xray",111d,31410901,,32.3900000,,-0.9355455,0.0000000,NO,,0.5740936
GDLTPEELKER,ph,T,506,false,"Tissue atlas Arabidopsis - ProteomicsDB",114,32188942,"MaxQuant score",215.5100000,1.0000000,,,,1.5606999704554E-31,
GDLTPEELK,ph,T,506,false,"Tyrosine phosphorylation in Arabidopsis",59,18463617,"MASCOT Score",34.0000000,,,,,,-0.7404163
GDLTPEELK,ph,T,506,false,"srk2dei ABA signaling phopshoproteomics",83,23572148,"MASCOT Score",20.0000000,,,,,,0.0006000
GDLTPEELK,ph,T,506,false,"atm and atr DNA damage response",88,25561503,"MASCOT Score",39.0000000,1.0000000,,,,,-1.3400000
GDLTPEELKER,ac,K,511,false,"Quantitative Acetylproteomics",101,29440448,,,,,,,,
GDLTPEELKER,ub,K,511,false,"Arabidopsis ubiquitination COFRADIC",40,26744219,"MaxQuant Score",113.2200000,1.0000000,,,,6.7840000284036E-9,0.2110000
QAKGMQDPEIQNILTDPVMR,me1,K,516,false,"Arabidopsis protein methylome",123,31809900,"MaxQuant Score",98.1750000,1.0000000,,,,1.8088599842789E-20,0.4891800
QAKGMQDPEIQNILTDPVMR,me2,K,516,false,"Arabidopsis protein methylome",123,31809900,"MaxQuant Score",188.8400000,1.0000000,,,,0,-0.1166400
HMQNPMIMNK,mox,M,550,true,"cat2 Methionine oxidation - 3h stress",62b,25693801,"MASCOT Score",34.0000000,,-0.0639513,,NO,,
HMQNPMIMNK,mox,M,554,true,"cat2 Methionine oxidation - 3h stress",62b,25693801,"MASCOT Score",34.0000000,,-0.0639513,,NO,,
HMQNPMIMNK,mox,M,556,true,"cat2 Methionine oxidation - 3h stress",62b,25693801,"MASCOT Score",34.0000000,,-0.0639513,,NO,,
LISSGIVQMK,mox,M,570,true,"cat2 Methionine oxidation - 1h stress",62a,25693801,"MASCOT Score",71.0000000,,0.1301939,,NO,,
LISSGIVQMK,mox,M,570,true,"cat2 Methionine oxidation - 3h stress",62b,25693801,"MASCOT Score",80.0000000,,0.2125224,,NO,,
