Peptide,PTM,ModifiedAA,ModifiedPosition,PeptideUniqueToGene,ExperimentDesc,ExpID,PubmedID,ScoreType,IdentScore,LocProb,Log2FChange,PQ-val,QuantSig,PEP,MassErrorPPM
MEEENVTSSPSTPVHRL,nta,M,1,true,"Arabidopsis translation initiation landscape - NTA",167a,35069635,,,,,,,,
MEEENVTSSPSTPVHR,nta,M,1,true,"Characterization plant N-terminal acetylation",6,22223895,"MASCOT Score",38.3500000,,,,,,
MEEENVTSSPSTPVHR,nta,M,1,true,"Arg/N-end rule pathway Roots",80,25728785,"MASCOT Score",96.3000000,,,,,5.1520000852179E-5,
MEEENVTSSPSTPVHR,nta,M,1,true,"Tic56 chloroplast import - ppi2",89b,25588737,XCorr,3.5774989,,,,,,
MEEENVTSSPSTPVHR,nta,M,1,true,"Arg/N-end rule seed, prt6 vs. Wt",99,29168982,"MASCOT Score",58.2500000,,,,,0.016380000859499,-1.8704537
MEEENVTSSPSTPVHR,nta,M,1,true,"HUNTER N-terminome: legumain, GluC and trypsin",119,31951383,"MaxQuant score",124.8600000,,,,,,
MEEENVTSSP,nta,M,1,true,"N-term acetylation drought responses",5,26184543,,,,,,,,
MEEENVTSSPSTPVHR,ph,T,7,true,"atm and atr DNA damage response",88,25561503,"MASCOT Score",57.0000000,0.9360000,,,,,-0.3900000
MEEENVTSSPSTPVHR,ph,S,8,true,"atm and atr DNA damage response",88,25561503,"MASCOT Score",37.0000000,0.9000000,,,,,-0.2000000
MEEENVTSSPSTPVHR,ph,S,8,true,"Tissue atlas Arabidopsis - ProteomicsDB",114,32188942,"MaxQuant score",213.7100000,0.9663880,,,,0,
MEEENVTSSPSTPVHR,ph,S,9,true,"atm and atr DNA damage response",88,25561503,"MASCOT Score",38.0000000,0.9040000,,,,,-0.2000000
MEEENVTSSPSTPVHR,ph,S,9,true,"Tissue atlas Arabidopsis - ProteomicsDB",114,32188942,"MaxQuant score",168.4500000,0.9434660,,,,1.1272199587353E-19,
MEEENVTSSPSTPVHR,ph,S,11,true,"atm and atr DNA damage response",88,25561503,"MASCOT Score",46.0000000,0.7870000,,,,,-0.2000000
MEEENVTSSPSTPVHR,ph,T,12,true,"atm and atr DNA damage response",88,25561503,"MASCOT Score",58.0000000,1.0000000,,,,,-0.1100000
MEEENVTSSPSTPVHR,ph,T,12,true,"TOR Kinase and ABA Receptor",100,29290610,XCorr,4.8211222,0.9377000,,,,9.7669999377104E-7,
MEEENVTSSPSTPVHR,ph,T,12,true,"Tissue atlas Arabidopsis - ProteomicsDB",114,32188942,"MaxQuant score",268.9300000,0.9490460,,,,0,
SNEVVTDGDKVNASPLLVNDR,ph,S,23,true,"STN8 phosphoproteome",38,21768351,"MASCOT Score",74.4100000,,,,,,-0.0718182
SNEVVTDGDKVNASPLLVNDR,ph,S,23,true,"Tissue atlas Arabidopsis - ProteomicsDB",114,32188942,"MaxQuant score",310.4300000,1.0000000,,,,0,
SNEVVTDGDKVNASPLLVNDR,ph,S,23,true,"Touch-induced phosphorylation: 40s touch vs untouc",136,30291188,"MASCOT score",123.4100000,,-0.0512352,0.8891233,NO,,2.5496021
RRSNEVVTDGDK,ph,S,23,true,"TOR Kinase and ABA Receptor",100,29290610,XCorr,4.5948815,1.0000000,,,,1.2670000160142E-7,
SNEVVTDGDK,ph,S,23,true,"atm and atr DNA damage response",88,25561503,"MASCOT Score",42.0000000,1.0000000,,,,,-1.5500000
VNASPLLVNDR,ph,S,36,true,"Tissue atlas Arabidopsis - ProteomicsDB",114,32188942,"MaxQuant score",128.6100000,1.0000000,,,,7.5273201218806E-6,
TPLIKLSPK,ph,S,239,false,"Ethylene-regulated phosphorylation ein2 mutant",30,19253305,"MASCOT Score",29.4118000,,,,,,46.8713700
