Peptide,PTM,ModifiedAA,ModifiedPosition,PeptideUniqueToGene,ExperimentDesc,ExpID,PubmedID,ScoreType,IdentScore,LocProb,Log2FChange,PQ-val,QuantSig,PEP,MassErrorPPM
SGGSNSNSSQVNSSETSGLSK,ph,S,16,true,"Tissue atlas Arabidopsis - ProteomicsDB",114,32188942,"MaxQuant score",110.9500000,0.8286390,,,,1.6121099680882E-12,
LIPKSHPDR,ac,K,83,true,"Quantitative Acetylproteomics",101,29440448,,,,,,,,
AACLMQMK,so,C,98,true,"Arabidopsis S-sulfenylation chemoproteomics",108,31578252,"pFind PSM Score",0.2053930,,0.8333300,,,,-1.3672881
DAGEISKR,ac,K,166,true,"Quantitative Acetylproteomics",101,29440448,,,,,,,,
KGVTSPVGSVSLPNASNGK,ph,T,215,true,"Tissue atlas Arabidopsis - ProteomicsDB",114,32188942,"MaxQuant score",235.7800000,0.8234090,,,,0,
KGVTSPVGSVSLPNASNGK,ph,S,216,true,"Large-scale phosphorylation discovery",44,23111157,XCorr,3.2010000,,,,,,
GVTSPVGSVSLPNASNGK,ph,S,216,true,"srk2dei ABA signaling phopshoproteomics",83,23572148,"MASCOT Score",65.0000000,,,,,,0.0006000
GVTSPVGSVSLPNASNGK,ph,S,216,true,"SnRK2 protein kinase substrates",85,23776212,XCorr,4.4019685,0.9470000,,,,0.00022632500622422,
GVTSPVGSVSLPNASNGK,ph,S,216,true,"atm and atr DNA damage response",88,25561503,"MASCOT Score",50.0000000,0.9970000,,,,,0.7600000
GVTSPVGSVSLPNASNGK,ph,S,216,true,"Col-0 callus - FC Col-0 vs. Col-0 Xray",111a,31410901,,22.5200000,,0.7272891,0.0000000,NO,,1.0967644
GVTSPVGSVSLPNASNGK,ph,S,216,true,"Col-0 X-ray callus - FC Col-0 vs. Col-0 Xray",111b,31410901,,22.5200000,,0.7272891,0.0000000,NO,,1.0967644
GVTSPVGSVSLPNASNGK,ph,S,216,true,"atm callus - FC atm vs. atm Xray",111c,31410901,,22.5200000,,0.1651405,0.0000000,NO,,1.0967644
GVTSPVGSVSLPNASNGK,ph,S,216,true,"atm-3 X-ray callus - FC atm vs. atm Xray",111d,31410901,,22.5200000,,0.1651405,0.0000000,NO,,1.0967644
GVTSPVGSVSLPNASNGK,ph,S,216,true,"Tissue atlas Arabidopsis - ProteomicsDB",114,32188942,"MaxQuant score",270.7900000,0.9940520,,,,0,
GVTSPVGSVSLPNASNGK,ph,S,220,true,"Lateral root-induction - NAA vs control",106,23328941,"MASCOT Score",23.0000000,,,,,,
GVTSPVGSVSLPNASNGK,ph,S,220,true,"Tissue atlas Arabidopsis - ProteomicsDB",114,32188942,"MaxQuant score",202.4900000,0.9982700,,,,0,
VERPQVVNPVTENGGSVSK,ph,S,246,true,"TOR Kinase and ABA Receptor",100,29290610,XCorr,3.9668448,0.9682000,,,,3.7249999422784E-6,
VERPQVVNPVTENGGSVSK,ph,S,246,true,"Tissue atlas Arabidopsis - ProteomicsDB",114,32188942,"MaxQuant score",152.2700000,0.9998710,,,,4.105189846621E-18,
VVLKPVSHSPK,ph,S,261,true,"Phosphoproteome iron-deficient Arabidopsis roots",41,22438062,"MASCOT Score",30.2300000,,,,,,
VVLKPVSHSPK,ph,S,261,true,"Tyrosine phosphorylation in Arabidopsis",59,18463617,"MASCOT Score",25.0000000,,,,,,-0.8663577
VVLKPVSHSPK,ph,S,261,true,"srk2dei ABA signaling phopshoproteomics",83,23572148,"MASCOT Score",29.0000000,,,,,,-0.0006000
VVLKPVSHSPK,ph,S,261,true,"Lateral root-induction - NAA vs control",106,23328941,"MASCOT Score",27.0000000,,,,,,
VVLKPVSHSPK,ph,S,261,true,"Col-0 callus - FC Col-0 vs. Col-0 Xray",111a,31410901,,33.6100000,,-0.9781260,0.0000000,NO,,0.1748648
VVLKPVSHSPK,ph,S,261,true,"Col-0 X-ray callus - FC Col-0 vs. Col-0 Xray",111b,31410901,,33.6100000,,-0.9781260,0.0000000,NO,,0.1748648
VVLKPVSHSPK,ph,S,261,true,"atm callus - FC atm vs. atm Xray",111c,31410901,,33.6100000,,2.1376146,0.0000000,NO,,0.1748648
VVLKPVSHSPK,ph,S,261,true,"atm-3 X-ray callus - FC atm vs. atm Xray",111d,31410901,,33.6100000,,2.1376146,0.0000000,NO,,0.1748648
VVLKPVSHSPK,ph,S,261,true,"Tissue atlas Arabidopsis - ProteomicsDB",114,32188942,"MaxQuant score",110.4400000,0.8907510,,,,8.7740299932193E-6,
VVLKPVSHSPK,ph,S,263,true,"Phosphorylation nuclei-enriched fractions",28,19245862,,,,,,,,
VVLKPVSHSPK,ph,S,263,true,"STN8 phosphoproteome",38,21768351,"MASCOT Score",49.0900000,,,,,,-0.5318690
VVLKPVSHSPK,ph,S,263,true,"Tyrosine phosphorylation in Arabidopsis",59,18463617,"MASCOT Score",44.0000000,,,,,,-0.9451174
VVLKPVSHSPK,ph,S,263,true,"Chloroplast kinase substrates",60,19376835,"MASCOT Score",35.1800000,,,,,,-0.4847260
VVLKPVSHSPK,ph,S,263,true,"Conserved plant phosphoproteome - Arabidopsis",61a,20466843,"MASCOT Score",44.0000000,1.0000000,,,,,
VVLKPVSHSPK,ph,S,263,true,"srk2dei ABA signaling phopshoproteomics",83,23572148,"MASCOT Score",49.0000000,,,,,,-0.0007000
VVLKPVSHSPK,ph,S,263,true,"LAXIC - mannitol vs control",84b,23660473,XCorr,2.3800000,0.9690000,,,,0.0010871100239456,
VVLKPVSHSPK,ph,S,263,true,"SnRK2 protein kinase substrates",85,23776212,XCorr,2.9332292,0.8330000,,,,0.012374799698591,
VVLKPVSHSPK,ph,S,263,true,"atm and atr DNA damage response",88,25561503,"MASCOT Score",70.0000000,0.9980000,,,,,-3.1800000
VVLKPVSHSPK,ph,S,263,true,"TOR Kinase and ABA Receptor",100,29290610,XCorr,2.8923414,0.9396000,,,,0.0018889999482781,
VVLKPVSHSPK,ph,S,263,true,"Lateral root-induction - NAA vs control",106,23328941,"MASCOT Score",41.0000000,,,,,,
VVLKPVSHSPK,ph,S,263,true,"Phospho cell culture sucrose/TOR",109,30833711,,,0.9995570,,,,,
VVLKPVSHSPK,ph,S,263,true,"Col-0 callus - FC Col-0 vs. Col-0 Xray",111a,31410901,,41.5100000,,7.2672398,0.0000000,NO,,-0.0429205
VVLKPVSHSPK,ph,S,263,true,"Col-0 X-ray callus - FC Col-0 vs. Col-0 Xray",111b,31410901,,41.5100000,,7.2672398,0.0000000,NO,,-0.0429205
VVLKPVSHSPK,ph,S,263,true,"atm callus - FC atm vs. atm Xray",111c,31410901,,41.5100000,,,0.0000000,NO,,-0.0429205
VVLKPVSHSPK,ph,S,263,true,"Tissue atlas Arabidopsis - ProteomicsDB",114,32188942,"MaxQuant score",165.3400000,0.9999550,,,,8.2848103377664E-12,
VEELGSSSVAVVGK,ph,S,275,true,"Tissue atlas Arabidopsis - ProteomicsDB",114,32188942,"MaxQuant score",125.2200000,0.7594930,,,,3.7467798392754E-5,
LGQMPVNCR,ox,C,310,true,"SPEAR - 10 mM H2O2 / mock",138a,34619326,,,,1.8851002,0.0017628,YES,,
LGQMPVNCR,so,C,310,true,"Arabidopsis S-sulfenylation chemoproteomics",108,31578252,"pFind PSM Score",0.0978522,,0.8809100,,,,0.9485927
AVLIKYK,ac,K,332,true,"Quantitative Acetylproteomics",101,29440448,,,,,,,,
LAESAADCILTK,sno,C,358,true,"hot5-4 / wildtype, FAT-switch S-nitrosoproteome",169,37277371,,,,0.3292076,0.2741513,NO,,
LAESAADCILTK,so,C,358,true,"S-sulfenylation site detection using YAP1C",110,32714340,,,,,,,,
EKASSSEDPETK,ph,S,435,true,"atm and atr DNA damage response",88,25561503,"MASCOT Score",53.0000000,0.9960000,,,,,0.6600000
EKASSSEDPETK,ph,S,435,true,"Tissue atlas Arabidopsis - ProteomicsDB",114,32188942,"MaxQuant score",191.6300000,0.9798510,,,,5.227669989512E-24,
ASSSEDPETK,ph,S,435,true,"atm and atr DNA damage response",88,25561503,"MASCOT Score",48.0000000,0.9980000,,,,,-0.8300000
ASSSEDPETK,ph,S,436,true,"atm and atr DNA damage response",88,25561503,"MASCOT Score",71.0000000,0.9480000,,,,,0.0800000
ASSSEDPETK,ph,S,437,true,"atm and atr DNA damage response",88,25561503,"MASCOT Score",61.0000000,0.9420000,,,,,0.5100000
SQVECK,sno,C,698,true,"hot5-4 / wildtype, FAT-switch S-nitrosoproteome",169,37277371,,,,,,,,
LAGASEADIATVVK,ph,S,722,true,"Tissue atlas Arabidopsis - ProteomicsDB",114,32188942,"MaxQuant score",116.5800000,0.9999980,,,,4.8009700549301E-5,
NHCSNEAAATEGDEK,sno,C,734,true,"Site-specific nitrosomeproteomic id - gsnor1-3",90a,25699590,XCorr,4.5807343,,,,,5.2229999880637E-8,-6.9406322
NHCSNEAAATEGDEK,sno,C,734,true,"Site-specific nitrosomeproteomic id - gsnor1-3",90b,25699590,XCorr,4.5400000,,,,,0.016920000314713,-5.5000000
NHCSNEAAATEGDEK,so,C,734,true,"Arabidopsis S-sulfenylation chemoproteomics",108,31578252,"pFind PSM Score",0.0000126,,1.7361100,,,,-0.3746682
