Peptide,PTM,ModifiedAA,ModifiedPosition,PeptideUniqueToGene,ExperimentDesc,ExpID,PubmedID,ScoreType,IdentScore,LocProb,Log2FChange,PQ-val,QuantSig,PEP,MassErrorPPM
MEKNMKFPVVDLSKLNGEER,nta,M,1,true,"FtsH12 N-terminome: WT / FtsH12 knockdown miRNA",118,33216923,"MaxQuant score",102.6600000,,,,,3.6000000758207E-9,
MEKNMKFPVVDLSKL,nta,M,1,true,"Arabidopsis translation initiation landscape - NTA",167a,35069635,,,,,,,,
MEKNMKFPVV,nta,M,1,true,"N-term acetylation drought responses",5,26184543,,,,,,,,
NMKFPVVDLSK,ub,K,6,true,"upl3 mutant / wildtype",168,35926874,"MaxQuant score",87.6670000,1.0000000,0.0000000,,,0.00021914200624451,0.1483000
EIVNHGLPHDLMDKIEKMTKDHY,nt,E,38,true,"Arabidopsis translation initiation landscape - NT",167b,35069635,,,,,,,,
TCQEQK,sno,C,63,true,"hot5-4 / wildtype, FAT-switch S-nitrosoproteome",169,37277371,,,,,,,,
MLKSKGLDNLETE,nt,M,71,true,"Arabidopsis translation initiation landscape - NT",167b,35069635,,,,,,,,
FNDMLKSK,ac,K,73,true,"Quantitative Acetylproteomics",101,29440448,,,,,,,,
FNDMLKSK,ph,S,74,true,"Phosphorylation Early Elicitor Signaling",23,17317660,,,,,,,,
FNDMLKSK,ph,S,74,true,"Tissue atlas Arabidopsis - ProteomicsDB",114,32188942,"MaxQuant score",80.2400000,1.0000000,,,,0.01712610013783,
STFYVRHLPQSNLNDISDVSDE,nt,S,91,true,"Arabidopsis translation initiation landscape - NT",167b,35069635,,,,,,,,
VRHLPQSNLNDISDVSDEYRTAMKDF,nt,V,95,true,"Arabidopsis translation initiation landscape - NT",167b,35069635,,,,,,,,
DISDVSDEYR,nt,D,105,true,"Arg/N-end rule seed, prt6 vs. Wt",99,29168982,"MASCOT Score",42.5100000,,-0.9507431,0.0641978,NO,0.011210000142455,-1.6140651
DISDVSDE,nt,D,105,true,"Arg/N-end rule seed, prt6 vs. Wt",99,29168982,"MASCOT Score",58.1800000,,-0.9292898,0.0542232,NO,0.0028639999218285,-2.0686025
VSNYPPCPKPEMIK,sno,C,168,true,"Site-specific nitrosomeproteomic id - gsnor1-3",90a,25699590,XCorr,2.4992590,,,,,0.012520000338554,-6.1421395
VSNYPPCPKPEMIK,sno,C,168,true,"Site-specific nitrosomeproteomic id - gsnor1-3",90b,25699590,XCorr,2.4300000,,,,,0.18960000574589,-7.2100000
VSNYPPCPKPEMIK,sno,C,168,true,"hot5-4 / wildtype, FAT-switch S-nitrosoproteome",169,37277371,,,,0.4094151,0.2173825,NO,,
VSNYPPCPKPEMIK,so,C,168,true,"Arabidopsis S-sulfenylation chemoproteomics",108,31578252,"pFind PSM Score",0.2738690,,1.0082300,,,,1.0330767
VVTQQEGNR,nt,V,239,true,"Metacaspase9 substrates - in vitro rMC9",51c,23964026,"MASCOT Score",45.0000000,,4.0129440,,NO,,0.6366174
VVTQQEGNR,ph,T,241,true,"Tissue atlas Arabidopsis - ProteomicsDB",114,32188942,"MaxQuant score",108.4700000,1.0000000,,,,0.0015494700055569,
SFYNPGSDAE,nt,S,252,false,"Arg/N-end rule seed, prt6 vs. Wt",99,29168982,"MASCOT Score",44.8300000,,-0.9877279,0.2075481,NO,0.0022919999901205,-1.2243994
MSVASFYNPGSDAEISPATSLVEK,ph,S,258,true,"TOR Kinase and ABA Receptor",100,29290610,XCorr,2.8811574,0.9933000,,,,5.6619999668328E-5,
DSEYPSFVFDDYMK,ph,S,277,true,"srk2dei ABA signaling phopshoproteomics",83,23572148,"MASCOT Score",32.0000000,,,,,,0.0016000
DSEYPSFVFDDYMK,ph,S,277,true,"Tissue atlas Arabidopsis - ProteomicsDB",114,32188942,"MaxQuant score",91.2070000,0.9972500,,,,6.6646396589931E-5,
EPRFAAMK,mox,M,302,true,"cat2 Methionine oxidation - 1h stress",62a,25693801,"MASCOT Score",51.0000000,,-0.0162319,,NO,,
EPRFAAMK,mox,M,302,true,"cat2 Methionine oxidation - 3h stress",62b,25693801,"MASCOT Score",36.0000000,,-2.3276307,,NO,,
