Peptide,PTM,ModifiedAA,ModifiedPosition,PeptideUniqueToGene,ExperimentDesc,ExpID,PubmedID,ScoreType,IdentScore,LocProb,Log2FChange,PQ-val,QuantSig,PEP,MassErrorPPM
SSERPDEEKPETRDVL,nta,S,2,true,"Arabidopsis translation initiation landscape - NTA",167a,35069635,,,,,,,,
SSERPDEEKPETR,nta,S,2,true,"Arg/N-end rule pathway Roots",80,25728785,"MASCOT Score",31.8400000,,,,,0.16550000011921,
VQDLIHGGGGASPVQSPTR,ph,S,30,true,"Conserved plant phosphoproteome - Arabidopsis",61a,20466843,"MASCOT Score",25.0000000,1.0000000,,,,,
VQDLIHGGGGASPVQSPTR,ph,S,30,true,"atm and atr DNA damage response",88,25561503,"MASCOT Score",63.0000000,1.0000000,,,,,-0.2400000
VQDLIHGGGGASPVQSPTR,ph,S,30,true,"TOR Kinase and ABA Receptor",100,29290610,XCorr,5.6525311,1.0000000,,,,4.7170001238328E-8,
VQDLIHGGGGASPVQSPTR,ph,S,30,true,"Tissue atlas Arabidopsis - ProteomicsDB",114,32188942,"MaxQuant score",255.8300000,1.0000000,,,,0,
VQDLIHGGGGASPVQSPTR,ph,S,34,true,"Conserved plant phosphoproteome - Arabidopsis",61a,20466843,"MASCOT Score",44.0000000,1.0000000,,,,,
VQDLIHGGGGASPVQSPTR,ph,S,34,true,"atm and atr DNA damage response",88,25561503,"MASCOT Score",43.0000000,0.9520000,,,,,-0.0500000
VQDLIHGGGGASPVQSPTR,ph,S,34,true,"TOR Kinase and ABA Receptor",100,29290610,XCorr,5.6525311,0.9912000,,,,4.7170001238328E-8,
VQDLIHGGGGASPVQSPTR,ph,S,34,true,"Tissue atlas Arabidopsis - ProteomicsDB",114,32188942,"MaxQuant score",255.8300000,0.9973730,,,,0,
LNPDPNSSVKR,ac,K,143,true,"Quantitative Acetylproteomics",101,29440448,,,,,,,,
DQALAWKPCADQR,acy,C,209,true,"Arabidopsis S-acylation atlas - Meristem",163a,35681017,,,,,,,,
DQALAWKPCADQR,acy,C,209,true,"Arabidopsis S-acylation atlas - Hypocotyl",163b,35681017,,,,,,,,
DQALAWKPCADQR,sno,C,209,true,"hot5-4 / wildtype, FAT-switch S-nitrosoproteome",169,37277371,,,,,,,,
MLNATLVIPK,ng,N,251,true,"Conserved N-glycosylation",74,22633491,"MaxQuant Score",96.0060000,1.0000000,,,,0.0010000000474975,-0.9900000
HFPTLANLTK,ng,N,464,true,"Conserved N-glycosylation",74,22633491,"MaxQuant Score",55.7920000,1.0000000,,,,0.06700000166893,-0.6200000
FSDILLKNNTIEWK,ng,N,607,true,"Conserved N-glycosylation",74,22633491,"MaxQuant Score",150.1400000,0.8710000,,,,2.5579999683893E-26,-1.4480000
