Peptide,PTM,ModifiedAA,ModifiedPosition,PeptideUniqueToGene,ExperimentDesc,ExpID,PubmedID,ScoreType,IdentScore,LocProb,Log2FChange,PQ-val,QuantSig,PEP,MassErrorPPM
GWSGLTLDSSSLDLLNPNR,ph,S,14,true,"BSK8 and BSL2 regulating sucrose-ph synthase",66,24924143,"MaxQuant Score",110.3500000,,,,,,1.8448000
SRIDEEDDQKTR,nta,S,38,true,"Arabidopsis translation initiation landscape - NTA",167a,35069635,,,,,,,,
FPVSLSGIR,ph,S,62,true,"Tissue atlas Arabidopsis - ProteomicsDB",114,32188942,"MaxQuant score",76.2280000,0.8031230,,,,0.0060607697814703,
FPVSLSGIR,ph,S,64,true,"Tissue atlas Arabidopsis - ProteomicsDB",114,32188942,"MaxQuant score",152.5400000,0.9992130,,,,0.0001936070038937,
DREDEDFSSGVAGDNDR,ph,S,75,true,"Phospho cell culture sucrose/TOR",109,30833711,,,0.9241290,,,,,
DREDEDFSSGVAGDNDR,ph,S,75,true,"Tissue atlas Arabidopsis - ProteomicsDB",114,32188942,"MaxQuant score",187.5900000,0.9638850,,,,4.4901198431919E-30,
AVGEAEDVSNSSSEDRTR,ph,S,240,true,"Tissue atlas Arabidopsis - ProteomicsDB",114,32188942,"MaxQuant score",183.3100000,0.8613530,,,,1.3717799644472E-26,
AVGEAEDVSNSSSEDRTR,ph,S,241,true,"Tissue atlas Arabidopsis - ProteomicsDB",114,32188942,"MaxQuant score",251.0700000,0.8613530,,,,0,
AVGEAEDVSNSSSEDRTR,ph,S,242,true,"Tissue atlas Arabidopsis - ProteomicsDB",114,32188942,"MaxQuant score",214.5000000,0.9105920,,,,0,
LGREESPETESNK,ph,S,268,true,"SnRK2 protein kinase substrates",85,23776212,XCorr,3.0247667,0.9990000,,,,0.040581598877907,
LGREESPETESNK,ph,S,268,true,"Phospho cell culture sucrose/TOR",109,30833711,,,0.9999910,,,,,
LGREESPETESNK,ph,S,268,true,"Col-0 callus - FC Col-0 vs. Col-0 Xray",111a,31410901,,23.5200000,,0.5544556,0.0000000,NO,,-0.1272487
LGREESPETESNK,ph,S,268,true,"Col-0 X-ray callus - FC Col-0 vs. Col-0 Xray",111b,31410901,,23.5200000,,0.5544556,0.0000000,NO,,-0.1272487
LGREESPETESNK,ph,S,268,true,"atm callus - FC atm vs. atm Xray",111c,31410901,,23.5200000,,-5.8149865,0.0000000,NO,,-0.1272487
LGREESPETESNK,ph,S,268,true,"atm-3 X-ray callus - FC atm vs. atm Xray",111d,31410901,,23.5200000,,-5.8149865,0.0000000,NO,,-0.1272487
LGREESPETESNK,ph,S,268,true,"Tissue atlas Arabidopsis - ProteomicsDB",114,32188942,"MaxQuant score",199.8400000,0.9999990,,,,8.3056001566389E-31,
EESPETESNK,ph,S,268,true,"atm and atr DNA damage response",88,25561503,"MASCOT Score",47.0000000,0.9430000,,,,,-1.1600000
LGREESPETESNK,ph,T,271,true,"Col-0 callus - FC Col-0 vs. Col-0 Xray",111a,31410901,,54.0500000,,-0.2906113,0.0000000,NO,,3.2539720
LGREESPETESNK,ph,T,271,true,"Col-0 X-ray callus - FC Col-0 vs. Col-0 Xray",111b,31410901,,54.0500000,,-0.2906113,0.0000000,NO,,3.2539720
LGREESPETESNK,ph,T,271,true,"atm callus - FC atm vs. atm Xray",111c,31410901,,54.0500000,,-0.4804584,0.0000000,NO,,3.2539720
LGREESPETESNK,ph,T,271,true,"atm-3 X-ray callus - FC atm vs. atm Xray",111d,31410901,,54.0500000,,-0.4804584,0.0000000,NO,,3.2539720
LGREESPETESNKIQK,ph,S,273,true,"Tissue atlas Arabidopsis - ProteomicsDB",114,32188942,"MaxQuant score",43.9560000,0.9910780,,,,0.0084707103669643,
