Peptide,PTM,ModifiedAA,ModifiedPosition,PeptideUniqueToGene,ExperimentDesc,ExpID,PubmedID,ScoreType,IdentScore,LocProb,Log2FChange,PQ-val,QuantSig,PEP,MassErrorPPM
SVDVYPSAAPPPPR,ph,S,373,true,"atm and atr DNA damage response",88,25561503,"MASCOT Score",30.0000000,0.9330000,,,,,0.5900000
SVDVYPSAAPPPPR,ph,S,373,true,"Tissue atlas Arabidopsis - ProteomicsDB",114,32188942,"MaxQuant score",132.3100000,1.0000000,,,,3.1288400350604E-5,
SVSQFQPPRR,ph,S,396,true,"Tissue atlas Arabidopsis - ProteomicsDB",114,32188942,"MaxQuant score",74.6110000,0.9231240,,,,0.00083590298891068,
SVAQAQPPRR,ph,S,414,true,"Tissue atlas Arabidopsis - ProteomicsDB",114,32188942,"MaxQuant score",93.3450000,1.0000000,,,,0.00062419602181762,
SVAQAQPPR,ph,S,414,true,"atm and atr DNA damage response",88,25561503,"MASCOT Score",44.0000000,1.0000000,,,,,-1.1200000
FLYSATAGEEDHSDGEKPDAR,ph,S,549,true,"atm and atr DNA damage response",88,25561503,"MASCOT Score",39.0000000,1.0000000,,,,,0.0400000
FLYSATAGEEDHSDGEKPDAR,ph,S,549,true,"TOR Kinase and ABA Receptor",100,29290610,XCorr,3.4062312,0.9803000,,,,1.7640000805841E-5,
FLYSATAGEEDHSDGEKPDAR,ph,S,549,true,"Tissue atlas Arabidopsis - ProteomicsDB",114,32188942,"MaxQuant score",181.9600000,1.0000000,,,,9.8090892502737E-45,
NSISRPSTWLR,ph,S,559,true,"Tissue atlas Arabidopsis - ProteomicsDB",114,32188942,"MaxQuant score",53.8280000,0.9791720,,,,0.012604500167072,
NSISRPSTWLR,ph,S,564,true,"Tissue atlas Arabidopsis - ProteomicsDB",114,32188942,"MaxQuant score",53.8280000,0.8478690,,,,0.016346100717783,
