Peptide,PTM,ModifiedAA,ModifiedPosition,PeptideUniqueToGene,ExperimentDesc,ExpID,PubmedID,ScoreType,IdentScore,LocProb,Log2FChange,PQ-val,QuantSig,PEP,MassErrorPPM
MLTKFETK,ac,K,4,false,"Quantitative Acetylproteomics",101,29440448,,,,,,,,
MLTKFETKSNR,ph,T,7,false,"SIRK1 phosphorylation",86a,23820729,"MaxQuant Score",75.7070000,0.8070000,,,,0.60699999332428,5.9640000
FETKSNR,ac,K,8,false,"Quantitative Acetylproteomics",101,29440448,,,,,,,,
MLTKFETKSNR,ph,S,9,false,"SIRK1 phosphorylation",86a,23820729,"MaxQuant Score",103.4400000,1.0000000,,,,0.098999999463558,7.0980000
MLTKFETKSNR,ph,S,9,false,"SIRK1 exp - sirk1 mutant vs WT",86b,23820729,,,,-0.3195027,,NO,,
MLTKFETKSNR,ph,S,9,false,"SIRK1 exp - 35S:SIRK1 vs WT",86c,23820729,,,,1.3960363,,NO,,
TVSPADDIMR,ph,S,173,true,"atm and atr DNA damage response",88,25561503,"MASCOT Score",33.0000000,1.0000000,,,,,0.0300000
TVSPADDIMR,ph,S,173,true,"Tissue atlas Arabidopsis - ProteomicsDB",114,32188942,"MaxQuant score",91.9610000,0.9999960,,,,0.00030310600413941,
QDIIVSNSEDKSIR,ac,K,270,false,"Histone deacetylases substrates - hda14 vs WT",98e,29061669,"MaxQuant Score",57.3000000,1.0000000,0.3180000,0.6982324,NO,0.00047999998787418,
YYEYSTQRDSQVIPIR,ph,S,351,true,"Tissue atlas Arabidopsis - ProteomicsDB",114,32188942,"MaxQuant score",170.5300000,0.9997610,,,,8.2907698873079E-20,
RPGTPSLNQSPR,ph,T,361,false,"Phosphoproteome ethylene-regulated time response",46,24043427,"MASCOT Score",32.7000000,,,,,,7.1425000
RPGTPSLNQSPR,ph,T,361,false,"atm and atr DNA damage response",88,25561503,"MASCOT Score",42.0000000,1.0000000,,,,,0.1400000
RPGTPSLNQSPR,ph,T,361,false,"TOR Kinase and ABA Receptor",100,29290610,XCorr,4.0335073,0.9347000,,,,9.1770001745317E-5,
RPGTPSLNQSPR,ph,T,361,false,"Lateral root-induction - NAA vs control",106,23328941,"MASCOT Score",22.0000000,,0.0209788,1.0000000,NO,,
RPGTPSLNQSPR,ph,T,361,false,"Phospho cell culture sucrose/TOR",109,30833711,,,0.9999100,,,,,
RPGTPSLNQSPR,ph,T,361,false,"Tissue atlas Arabidopsis - ProteomicsDB",114,32188942,"MaxQuant score",190.8200000,0.9999970,,,,7.8140099276698E-25,
RPGTPSLNQSPR,ph,S,363,false,"Lateral root-induction - NAA vs control",106,23328941,"MASCOT Score",25.0000000,,,,,,
RPGTPSLNQSPR,ph,S,363,false,"Phospho cell culture sucrose/TOR",109,30833711,,,0.9611770,,,,,
QSPRTLSYSPTEN,nt,Q,366,false,"HUNTER N-terminome: legumain, GluC and trypsin",119,31951383,"MaxQuant score",176.8000000,,,,,,
DSVGRSDVVQDAK,ph,S,404,false,"atm and atr DNA damage response",88,25561503,"MASCOT Score",38.0000000,1.0000000,,,,,-1.0200000
DSVGRSDVVQDAK,ph,S,404,false,"Tissue atlas Arabidopsis - ProteomicsDB",114,32188942,"MaxQuant score",143.7500000,0.9993650,,,,2.791719907691E-6,
SDVVQDAKR,ac,K,411,false,"Quantitative Acetylproteomics",101,29440448,,,,,,,,
STSQVLVK,ph,S,434,false,"Tissue atlas Arabidopsis - ProteomicsDB",114,32188942,"MaxQuant score",74.6000000,0.9988950,,,,0.011358899995685,
STSQVLVKNLK,ac,K,439,false,"Quantitative Acetylproteomics",101,29440448,,,,,,,,
NLKNEVVKK,ac,K,442,false,"Quantitative Acetylproteomics",101,29440448,,,,,,,,
NLKNEVVK,ac,K,442,false,"Quantitative Acetylproteomics",101,29440448,,,,,,,,
LVLQCTLHETIR,so,C,524,false,"Arabidopsis S-sulfenylation chemoproteomics",108,31578252,"pFind PSM Score",0.0000787,,1.1291000,,,,-0.2760425
LVLQCTLHETIR,so,C,524,false,"S-sulfenylation site detection using YAP1C",110,32714340,,,,,,,,
YCLPNGDSGIIR,sno,C,554,false,"Site-specific nitrosomeproteomic id - gsnor1-3",90a,25699590,XCorr,2.6700809,,,,,0.00015380000695586,-7.1174351
YCLPNGDSGIIR,so,C,554,false,"S-sulfenylation site detection using YAP1C",110,32714340,,,,,,,,
VSGNTIFCLDR,so,C,582,false,"Arabidopsis S-sulfenylation chemoproteomics",108,31578252,"pFind PSM Score",0.0020741,,0.8064500,,,,-1.4125828
VSGNTIFCLDR,so,C,582,false,"S-sulfenylation site detection using YAP1C",110,32714340,,,,,,,,
YDHVMSMIK,ph,S,615,false,"Tissue atlas Arabidopsis - ProteomicsDB",114,32188942,"MaxQuant score",105.2000000,1.0000000,,,,0.00074698397656903,
NSQLCGQAMIAYLQQK,so,C,623,false,"S-sulfenylation site detection using YAP1C",110,32714340,,,,,,,,
GIFEGGLESADR,ph,S,824,true,"atm and atr DNA damage response",88,25561503,"MASCOT Score",64.0000000,1.0000000,,,,,0.2300000
GIFEGGLESADR,ph,S,824,true,"Tissue atlas Arabidopsis - ProteomicsDB",114,32188942,"MaxQuant score",192.4000000,1.0000000,,,,2.5950999426875E-24,
DIEDILAAAEAGEEENDEEGGWGLEDLVLPPELDTPKASANAR,ph,T,889,true,"SnRK2 protein kinase substrates",85,23776212,XCorr,3.0873024,0.8160000,,,,0.043809600174427,
DIEDILAAAEAGEEENDEEGGWGLEDLVLPPELDTPK,ph,T,889,true,"SnRK2 protein kinase substrates",85,23776212,XCorr,4.9057112,1.0000000,,,,5.5792401948418E-12,
SSVFVTPPQGMPVSQSWSQK,ph,T,903,true,"Tissue atlas Arabidopsis - ProteomicsDB",114,32188942,"MaxQuant score",125.2300000,0.9854720,,,,1.4596999512861E-16,
SSLAAEQAAAGSFDTAMR,ph,S,929,false,"Phospho cell culture sucrose/TOR",109,30833711,,,0.8872010,,,,,
SSLAAEQAAAGSFDTAMR,ph,S,929,false,"Tissue atlas Arabidopsis - ProteomicsDB",114,32188942,"MaxQuant score",153.2100000,0.9568070,,,,4.8446698754991E-18,
AFSSCPVVPLAIER,ph,S,969,true,"Tissue atlas Arabidopsis - ProteomicsDB",114,32188942,"MaxQuant score",107.7400000,0.9697920,,,,8.7353400886059E-5,
AFSSCPVVPLAIER,so,C,970,true,"S-sulfenylation site detection using YAP1C",110,32714340,,,,,,,,
GWSESSSPNVR,ph,S,982,false,"atm and atr DNA damage response",88,25561503,"MASCOT Score",44.0000000,1.0000000,,,,,0.3300000
GWSESSSPNVR,ph,S,984,false,"srk2dei ABA signaling phopshoproteomics",83,23572148,"MASCOT Score",33.0000000,,,,,,-0.0006000
GWSESSSPNVR,ph,S,984,false,"Tissue atlas Arabidopsis - ProteomicsDB",114,32188942,"MaxQuant score",116.0100000,0.8909440,,,,2.8807000489905E-5,
GWSESSSPNVR,ph,S,985,false,"Conserved plant phosphoproteome - Arabidopsis",61a,20466843,"MASCOT Score",51.0000000,1.0000000,,,,,
GWSESSSPNVR,ph,S,985,false,"Lateral root-induction - NAA vs control",106,23328941,"MASCOT Score",27.0000000,,,,,,
GWSESSSPNVR,ph,S,985,false,"Tissue atlas Arabidopsis - ProteomicsDB",114,32188942,"MaxQuant score",97.1630000,0.8114660,,,,0.00010478799958946,
GWSESSSPNVR,ph,S,986,false,"Large-scale phosphorylation discovery",44,23111157,XCorr,3.3750000,,,,,,
GWSESSSPNVR,ph,S,986,false,"Tyrosine phosphorylation in Arabidopsis",59,18463617,"MASCOT Score",41.0000000,,,,,,-0.9342067
GWSESSSPNVR,ph,S,986,false,"srk2dei ABA signaling phopshoproteomics",83,23572148,"MASCOT Score",44.0000000,,,,,,0.0004000
GWSESSSPNVR,ph,S,986,false,"LAXIC - ABA stress",84a,23660473,XCorr,2.5200000,0.9940000,,,,0.010745200328529,
GWSESSSPNVR,ph,S,986,false,"LAXIC - mannitol vs control",84b,23660473,XCorr,2.3500000,0.9970000,,,,0.0051696998998523,
GWSESSSPNVR,ph,S,986,false,"SnRK2 protein kinase substrates",85,23776212,XCorr,2.3867612,0.9920000,,,,0.025788500905037,
GWSESSSPNVR,ph,S,986,false,"atm and atr DNA damage response",88,25561503,"MASCOT Score",30.0000000,0.9980000,,,,,0.5400000
GWSESSSPNVR,ph,S,986,false,"Phospho cell culture sucrose/TOR",109,30833711,,,0.9970140,,,,,
GWSESSSPNVR,ph,S,986,false,"Tissue atlas Arabidopsis - ProteomicsDB",114,32188942,"MaxQuant score",224.6600000,0.9985870,,,,9.8444400904803E-34,
SPPALVYDFSQLDEK,ph,S,991,true,"Tyrosine phosphorylation in Arabidopsis",59,18463617,"MASCOT Score",22.0000000,,,,,,-1.5102368
HTIPLVVVE,nt,H,1030,true,"Arg/N-end rule seed, prt6 vs. Wt",99,29168982,"MASCOT Score",37.3800000,,-0.6164559,0.2429824,NO,0.016209999099374,-1.6648789
TIPLVVVETR,nt,T,1031,true,"Arg/N-end rule seed, prt6 vs. Wt",99,29168982,"MASCOT Score",37.1000000,,-0.3688695,0.4815687,NO,0.063960000872612,-1.4614960
LLETSPVDSQAK,ph,S,1124,true,"Tissue atlas Arabidopsis - ProteomicsDB",114,32188942,"MaxQuant score",172.0900000,0.9992160,,,,7.586950341522E-15,
LLETSPVDSQAK,ph,S,1128,true,"Tissue atlas Arabidopsis - ProteomicsDB",114,32188942,"MaxQuant score",111.1200000,0.9990530,,,,6.2453902501147E-5,
