Peptide,PTM,ModifiedAA,ModifiedPosition,PeptideUniqueToGene,ExperimentDesc,ExpID,PubmedID,ScoreType,IdentScore,LocProb,Log2FChange,PQ-val,QuantSig,PEP,MassErrorPPM
MALLSRIR,ph,S,5,true,"SIRK1 phosphorylation",86a,23820729,"MaxQuant Score",94.9220000,1.0000000,,,,0.15999999642372,6.6700000
IRSSTSLFR,ph,S,9,true,"Tissue atlas Arabidopsis - ProteomicsDB",114,32188942,"MaxQuant score",78.9030000,0.8991730,,,,0.0055367299355567,
ILEICR,sno,C,67,false,"hot5-4 / wildtype, FAT-switch S-nitrosoproteome",169,37277371,,,,,,,,
ILEICR,so,C,67,false,"Arabidopsis S-sulfenylation chemoproteomics",108,31578252,"pFind PSM Score",0.3282570,,,,,,-1.0678532
ILEICRAASLTPDCR,ph,S,71,true,"Tissue atlas Arabidopsis - ProteomicsDB",114,32188942,"MaxQuant score",54.7680000,1.0000000,,,,0.0055329101160169,
ILEICRAASLTPDCR,ph,T,73,true,"Tissue atlas Arabidopsis - ProteomicsDB",114,32188942,"MaxQuant score",54.7680000,1.0000000,,,,0.0055329101160169,
AASLTPDCR,ox,C,76,true,"OxiTRAQ Arabidopsis - 5 mM H2O2 versus control",47,24376095,,,,1.8190852,0.0046812,YES,,
AASLTPDCR,ox,C,76,true,"Redox kickstart of mitochondria",112,31871212,,,,-1.1066012,0.0000065,YES,,
AASLTPDCR,sno,C,76,true,"hot5-4 / wildtype, FAT-switch S-nitrosoproteome",169,37277371,,,,-4.0790794,0.0015246,YES,,
PNSSSFGLMISGFYAEDK,ph,S,230,true,"SIRK1 phosphorylation",86a,23820729,"MaxQuant Score",93.0100000,0.9380000,,,,0.94999998807907,8.0760000
PNSSSFGLMISGFYAEDK,ph,S,230,true,"SIRK1 exp - sirk1 mutant vs WT",86b,23820729,,,,-0.5060179,,NO,,
PNSSSFGLMISGFYAEDK,ph,S,230,true,"SIRK1 exp - 35S:SIRK1 vs WT",86c,23820729,,,,-0.8666879,,NO,,
PNSSSFGLMISGFYAEDK,ph,Y,233,true,"SIRK1 phosphorylation",86a,23820729,"MaxQuant Score",115.7600000,0.9630000,,,,0.19200000166893,3.3310000
IQSLCK,sno,C,268,false,"hot5-4 / wildtype, FAT-switch S-nitrosoproteome",169,37277371,,,,,,,,
GGDFETALSLCK,sno,C,350,true,"hot5-4 / wildtype, FAT-switch S-nitrosoproteome",169,37277371,,,,-0.4397745,0.0223552,NO,,
