Peptide,PTM,ModifiedAA,ModifiedPosition,PeptideUniqueToGene,ExperimentDesc,ExpID,PubmedID,ScoreType,IdentScore,LocProb,Log2FChange,PQ-val,QuantSig,PEP,MassErrorPPM
HGSLGFLPR,ph,S,13,false,"atm and atr DNA damage response",88,25561503,"MASCOT Score",47.0000000,1.0000000,,,,,-0.3800000
HGSLGFLPR,ph,S,13,false,"TOR Kinase and ABA Receptor",100,29290610,XCorr,2.3405902,1.0000000,,,,0.00042590001248755,
HGSLGFLPR,ph,S,13,false,"Tissue atlas Arabidopsis - ProteomicsDB",114,32188942,"MaxQuant score",148.5600000,1.0000000,,,,0.00012030499783577,
TVWAQHLSE,nt,T,104,false,"Arg/N-end rule seed, prt6 vs. Wt",99,29168982,"MASCOT Score",25.4100000,,-0.2684379,0.4343953,NO,0.032940000295639,-1.4108243
FYKNWAK,ac,K,120,false,"Quantitative Acetylproteomics",101,29440448,,,,,,,,
KVACIGAWHPAR,pgk,K,251,false,"Open search Plant PTM Viewer 2.0 - 3pgK",164f,TBA,,,,,,,,
VACIGAWHPAR,sno,C,254,false,"hot5-4 / wildtype, FAT-switch S-nitrosoproteome",169,37277371,,,,0.1545476,0.6477689,NO,,
KVACIGAWHPAR,so,C,254,false,"S-sulfenylation site detection using YAP1C",110,32714340,,,,,,,,
VACIGAWHPAR,so,C,254,false,"Arabidopsis S-sulfenylation chemoproteomics",108,31578252,"pFind PSM Score",0.0152257,,0.6738100,,,,-0.1620031
AGQNGYHHR,nt,A,270,false,"Arabidopsis translation initiation landscape - NT",167b,35069635,,,,,,,,
GCCVGPK,sno,C,331,false,"hot5-4 / wildtype, FAT-switch S-nitrosoproteome",169,37277371,,,,0.3540951,0.0161364,NO,,
FQTSQEKAK,ac,K,380,true,"Quantitative Acetylproteomics",101,29440448,,,,,,,,
