Peptide,PTM,ModifiedAA,ModifiedPosition,PeptideUniqueToGene,ExperimentDesc,ExpID,PubmedID,ScoreType,IdentScore,LocProb,Log2FChange,PQ-val,QuantSig,PEP,MassErrorPPM
RAHEGEVSGEEKR,ph,S,446,true,"Tissue atlas Arabidopsis - ProteomicsDB",114,32188942,"MaxQuant score",132.0800000,1.0000000,,,,6.3806101024966E-6,
AHEGEVSGEEKR,ph,S,446,true,"atm and atr DNA damage response",88,25561503,"MASCOT Score",44.0000000,1.0000000,,,,,0.1500000
RAHEGEVSGEEK,ph,S,446,true,"TOR Kinase and ABA Receptor",100,29290610,XCorr,3.1317952,1.0000000,,,,0.015909999608994,
GASVGANSNGLQTK,ph,S,489,true,"Tissue atlas Arabidopsis - ProteomicsDB",114,32188942,"MaxQuant score",70.4700000,0.9999940,,,,0.0011026499560103,
NTASGDSIITTHK,ph,S,504,true,"Tissue atlas Arabidopsis - ProteomicsDB",114,32188942,"MaxQuant score",135.0800000,0.9999350,,,,4.1472998418612E-5,
NTASGDSIITTHK,ph,S,507,true,"Tissue atlas Arabidopsis - ProteomicsDB",114,32188942,"MaxQuant score",58.9800000,0.7559380,,,,0.0022759099956602,
YIEDGGDSFDHFESEDSAR,ph,S,521,true,"Tissue atlas Arabidopsis - ProteomicsDB",114,32188942,"MaxQuant score",123.3200000,0.9997620,,,,6.4386099872375E-15,
YIEDGGDSFDHFESEDSAR,ph,S,527,true,"Tissue atlas Arabidopsis - ProteomicsDB",114,32188942,"MaxQuant score",69.7200000,0.9734910,,,,8.4612096543424E-5,
YIEDGGDSFDHFESEDSAR,ph,S,530,true,"Tissue atlas Arabidopsis - ProteomicsDB",114,32188942,"MaxQuant score",91.5410000,0.8202070,,,,2.859889946194E-6,
TRDSTEECMLLLK,ph,S,540,true,"Tissue atlas Arabidopsis - ProteomicsDB",114,32188942,"MaxQuant score",103.6700000,0.8413270,,,,0.00034572998993099,
KSGSGEDWFTASGNR,ph,S,576,true,"atm and atr DNA damage response",88,25561503,"MASCOT Score",78.0000000,0.9170000,,,,,-0.8500000
SGSGEDWFTASGNR,ph,S,576,true,"atm and atr DNA damage response",88,25561503,"MASCOT Score",85.0000000,0.9990000,,,,,-0.1900000
SGSGEDWFTASGNR,ph,S,576,true,"Tissue atlas Arabidopsis - ProteomicsDB",114,32188942,"MaxQuant score",247.3000000,0.9992990,,,,0,
MSFDDSILTSQGSDK,ph,S,599,true,"srk2dei ABA signaling phopshoproteomics",83,23572148,"MASCOT Score",49.0000000,,,,,,0.0009000
MSFDDSILTSQGSDK,ph,S,599,true,"atm and atr DNA damage response",88,25561503,"MASCOT Score",36.0000000,0.9950000,,,,,-0.2400000
MSFDDSILTSQGSDK,ph,S,599,true,"TOR Kinase and ABA Receptor",100,29290610,XCorr,3.3679588,0.9993000,,,,0.00036060001002625,
MSFDDSILTSQGSDK,ph,S,599,true,"Tissue atlas Arabidopsis - ProteomicsDB",114,32188942,"MaxQuant score",190.2800000,1.0000000,,,,4.8416798559321E-34,
MSFDDSILTSQGSDK,ph,S,610,true,"Tissue atlas Arabidopsis - ProteomicsDB",114,32188942,"MaxQuant score",120.8200000,0.9714690,,,,9.6784594916244E-7,
KVSLDKGSSR,ub,K,790,true,"Arabidopsis ubiquitination COFRADIC",40,26744219,"MaxQuant Score",45.4330000,1.0000000,,,,0.01799999922514,-0.6380000
