Peptide,PTM,ModifiedAA,ModifiedPosition,PeptideUniqueToGene,ExperimentDesc,ExpID,PubmedID,ScoreType,IdentScore,LocProb,Log2FChange,PQ-val,QuantSig,PEP,MassErrorPPM
ASTALSSAIVGTSFIR,nt,A,2,true,"Tic56 chloroplast import - ppi2",89b,25588737,XCorr,3.7539699,,,,,,
ASTALSSAIVGTSFIR,nta,A,2,true,"Tic56 chloroplast import - ppi2",89b,25588737,XCorr,3.7539699,,,,,,
ASTALSSAIVGTSFIR,nta,A,2,true,"HUNTER N-terminome: legumain, GluC and trypsin",119,31951383,"MaxQuant score",153.3800000,,,,,,
MASTALSSAIVGTSFIR,ph,S,7,true,"BSK8 and BSL2 regulating sucrose-ph synthase",66,24924143,"MaxQuant Score",72.3210000,,,,,,3.2271000
MASTALSSAIVGTSFIR,ph,S,8,true,"BSK8 and BSL2 regulating sucrose-ph synthase",66,24924143,"MaxQuant Score",72.3210000,,,,,,3.2271000
AMATYKVKFITPE,nt,A,51,false,"HUNTER N-terminome: legumain, GluC and trypsin",119,31951383,"MaxQuant score",80.3120000,,,,,,
ATYKVKFITPEGELEVECD,nt,A,53,true,"Arabidopsis translation initiation landscape - NT",167b,35069635,,,,,,,,
ATYKVKFITPEGELE,nt,A,53,true,"HUNTER N-terminome: legumain, GluC and trypsin",119,31951383,"MaxQuant score",111.1200000,,,,,,
ATYKVKFITPEGE,nt,A,53,false,"HUNTER N-terminome: legumain, GluC and trypsin",119,31951383,"MaxQuant score",206.3600000,,,,,,
ATYKVKFITPE,nt,A,53,false,"Stromal N-terminome",96,26371235,"MASCOT Score",35.5800000,,,,,,
ATYKVKFITPE,nt,A,53,false,"HUNTER N-terminome: legumain, GluC and trypsin",119,31951383,"MaxQuant score",122.5100000,,,,,,
AGSCSSCAGK,ox,C,96,false,"OxiTRAQ Arabidopsis - 5 mM H2O2 versus control",47,24376095,,,,-0.5315747,0.1323423,NO,,
AGSCSSCAGK,so,C,96,false,"S-sulfenylation site detection using YAP1C",110,32714340,,,,,,,,
AGSCSSCAGK,ox,C,99,false,"OxiTRAQ Arabidopsis - 5 mM H2O2 versus control",47,24376095,,,,-0.5315747,0.1323423,NO,,
AGSCSSCAGK,sno,C,99,false,"hot5-4 / wildtype, FAT-switch S-nitrosoproteome",169,37277371,,,,0.3368311,0.0264352,NO,,
TCAAYPTSDVTIETHKEEDIV,nt,T,128,true,"HUNTER N-terminome: legumain, GluC and trypsin",119,31951383,"MaxQuant score",63.8570000,,,,,,
AAYPTSDVTIETHKEEDIV,nt,A,130,true,"Arg/N-end rule seed, prt6 vs. Wt",99,29168982,"MASCOT Score",35.9100000,,-0.6451550,0.0175199,NO,0.00023520000104327,0.7496463
AAYPTSDVTIE,nt,A,130,true,"Arg/N-end rule seed, prt6 vs. Wt",99,29168982,"MASCOT Score",51.7800000,,-0.3371150,0.3870460,NO,0.00012880000576843,1.0303821
AYPTSDVTIE,nt,A,131,true,"Arg/N-end rule seed, prt6 vs. Wt",99,29168982,"MASCOT Score",36.3800000,,-0.3835868,0.0668601,NO,0.05256000161171,-3.0531254
YPTSDVTIE,nt,Y,132,true,"Arg/N-end rule seed, prt6 vs. Wt",99,29168982,"MASCOT Score",36.8400000,,-1.0229853,0.1042916,NO,0.038199998438358,-0.0043608
