Peptide,PTM,ModifiedAA,ModifiedPosition,PeptideUniqueToGene,ExperimentDesc,ExpID,PubmedID,ScoreType,IdentScore,LocProb,Log2FChange,PQ-val,QuantSig,PEP,MassErrorPPM
CRYCPTVVCLNENTMQAHVSSK,ph,S,136,true,"Brassinosteroid-Regulated Phosphorylation Dynamics",94,26187819,"MaxQuant Score",69.7370000,0.8760000,,,,0.016000000759959,-1.3000000
IRTDDEEVDDLETASQEKEK,ph,T,154,true,"Phospho cell culture sucrose/TOR",109,30833711,,,1.0000000,,,,,
IRTDDEEVDDLETASQEK,ph,T,154,true,"TOR Kinase and ABA Receptor",100,29290610,XCorr,5.7065134,1.0000000,,,,3.4229998391311E-8,
IRTDDEEVDDLETASQEK,ph,T,154,true,"Tissue atlas Arabidopsis - ProteomicsDB",114,32188942,"MaxQuant score",259.1600000,1.0000000,,,,0,
IRTDDEEVDDLETASQEKEK,ph,S,166,true,"Phospho cell culture sucrose/TOR",109,30833711,,,0.9920280,,,,,
TDDEEVDDLETASQEKEK,ph,S,166,true,"atm and atr DNA damage response",88,25561503,"MASCOT Score",74.0000000,0.9940000,,,,,-1.9300000
IRTDDEEVDDLETASQEK,ph,S,166,true,"Tissue atlas Arabidopsis - ProteomicsDB",114,32188942,"MaxQuant score",258.5500000,0.9998750,,,,0,
NGENEEVEDPETPSQEK,ph,T,206,true,"Tissue atlas Arabidopsis - ProteomicsDB",114,32188942,"MaxQuant score",222.2800000,0.9387300,,,,0,
HGENEEVDNSGTPSQGK,ph,T,248,true,"TOR Kinase and ABA Receptor",100,29290610,XCorr,4.7059765,0.9052000,,,,3.8479997783725E-6,
HGENEEVDNSGTPSQGK,ph,T,248,true,"Tissue atlas Arabidopsis - ProteomicsDB",114,32188942,"MaxQuant score",126.2300000,0.9795060,,,,1.6527299528946E-9,
HGENEEVDNPETPSQEK,ph,T,290,true,"Tissue atlas Arabidopsis - ProteomicsDB",114,32188942,"MaxQuant score",158.5000000,1.0000000,,,,6.8812300184405E-16,
HGENEEVDNPETPSQEK,ph,S,292,true,"Tissue atlas Arabidopsis - ProteomicsDB",114,32188942,"MaxQuant score",103.0400000,1.0000000,,,,2.1480300347321E-6,
