Peptide,PTM,ModifiedAA,ModifiedPosition,PeptideUniqueToGene,ExperimentDesc,ExpID,PubmedID,ScoreType,IdentScore,LocProb,Log2FChange,PQ-val,QuantSig,PEP,MassErrorPPM
AETSKQVNGDDAQDLHSLLSSPAR,nt,A,2,true,"Arg/N-end rule seed, prt6 vs. Wt",99,29168982,"MASCOT Score",23.3400000,,,,,0.056540001183748,0.6917884
AETSKQVNGDDAQDLHSLLSSPAR,nt,A,2,true,"FtsH12 N-terminome: WT / FtsH12 knockdown miRNA",118,33216923,"MaxQuant score",117.0300000,,-0.3229726,0.2595570,NO,8.4077907859489E-45,
AETSKQVNGDDAQDLH,nt,A,2,true,"Arg/N-end rule seed, prt6 vs. Wt",99,29168982,"MASCOT Score",35.1300000,,,,,0.005038000177592,-2.5493673
AETSKQVNGDDAQDLHSLLSSPAR,nta,A,2,true,"Arg/N-end rule seed, prt6 vs. Wt",99,29168982,"MASCOT Score",23.3400000,,-0.7004005,0.2951301,NO,0.056540001183748,0.6917884
AETSKQVNGDDAQDLHSLLSSPAR,nta,A,2,true,"HUNTER N-terminome: legumain, GluC and trypsin",119,31951383,"MaxQuant score",64.0280000,,,,,,
AETSKQVNGDDAQDLHSLLSSPAR,nta,A,2,true,"Arabidopsis translation initiation landscape - NTA",167a,35069635,,,,,,,,
AETSKQVNGDDAQDLH,nta,A,2,true,"Arg/N-end rule seed, prt6 vs. Wt",99,29168982,"MASCOT Score",35.1300000,,0.2913267,0.0298541,NO,0.005038000177592,-2.5493673
CTELTPK,sno,C,218,true,"hot5-4 / wildtype, FAT-switch S-nitrosoproteome",169,37277371,,,,,,,,
AFTPKLVEVYK,ub,K,384,true,"upl3 mutant / wildtype",168,35926874,"MaxQuant score",67.3850000,1.0000000,1.1966070,,,0.00089883798500523,2.1773000
LVEVYKQIK,ub,K,390,true,"upl3 mutant / wildtype",168,35926874,"MaxQuant score",65.2240000,1.0000000,0.1016501,0.5330200,NO,0.0057728299871087,-0.7041600
CALNEDTKENGDEAVK,sno,C,543,true,"Site-specific nitrosomeproteomic id - gsnor1-3",90b,25699590,XCorr,2.9600000,,,,,0.0034070000983775,-7.4300000
VGGDESKDGWVCEGNVCTK,ph,S,564,true,"Phospho cell culture sucrose/TOR",109,30833711,,,1.0000000,,,,,
VGGDESKDGWVCEGNVCTK,ph,S,564,true,"Tissue atlas Arabidopsis - ProteomicsDB",114,32188942,"MaxQuant score",198.4500000,1.0000000,,,,0,
