Peptide,PTM,ModifiedAA,ModifiedPosition,PeptideUniqueToGene,ExperimentDesc,ExpID,PubmedID,ScoreType,IdentScore,LocProb,Log2FChange,PQ-val,QuantSig,PEP,MassErrorPPM
ESQGTKENQAEGPESEQDK,ph,S,316,true,"srk2dei ABA signaling phopshoproteomics",83,23572148,"MASCOT Score",20.0000000,,,,,,0.0012000
SKDGDSNTDVAR,ph,S,400,true,"atm and atr DNA damage response",88,25561503,"MASCOT Score",40.0000000,0.9960000,,,,,-0.1800000
SDAAANDVETSGEHNRPDTSSPDWSKR,ph,S,407,true,"Tissue atlas Arabidopsis - ProteomicsDB",114,32188942,"MaxQuant score",156.1200000,1.0000000,,,,0,
SDAAANDVETSGEHNRPDTSSPDWSK,ph,T,416,true,"srk2dei ABA signaling phopshoproteomics",83,23572148,"MASCOT Score",25.0000000,,,,,,0.0022000
SDAAANDVETSGEHNRPDTSSPDWSK,ph,T,416,true,"TOR Kinase and ABA Receptor",100,29290610,XCorr,4.3898978,0.8449000,,,,0.00039920001290739,
SDAAANDVETSGEHNRPDTSSPDWSKR,ph,S,417,true,"Tissue atlas Arabidopsis - ProteomicsDB",114,32188942,"MaxQuant score",128.4000000,0.7837170,,,,3.7135299176216E-34,
SDAAANDVETSGEHNRPDTSSPDWSKR,ph,T,425,true,"Tissue atlas Arabidopsis - ProteomicsDB",114,32188942,"MaxQuant score",364.0200000,0.9787590,,,,0,
SDAAANDVETSGEHNRPDTSSPDWSK,ph,T,425,true,"srk2dei ABA signaling phopshoproteomics",83,23572148,"MASCOT Score",45.0000000,,,,,,-0.0003000
SDAAANDVETSGEHNRPDTSSPDWSK,ph,T,425,true,"Lateral root-induction - NAA vs control",106,23328941,"MASCOT Score",25.0000000,,,,,,
SDAAANDVETSGEHNRPDTSSPDWSK,ph,S,426,true,"srk2dei ABA signaling phopshoproteomics",83,23572148,"MASCOT Score",59.0000000,,,,,,0.0009000
SDAAANDVETSGEHNRPDTSSPDWSKR,ph,S,427,true,"PAMP-triggered phosphorylation",48,24601666,"MASCOT Score",38.0900000,,,,,,
SDAAANDVETSGEHNRPDTSSPDWSKR,ph,S,427,true,"Col-0 callus - FC Col-0 vs. Col-0 Xray",111a,31410901,,21.5900000,,-1.4005051,0.0000000,NO,,1.4099914
SDAAANDVETSGEHNRPDTSSPDWSKR,ph,S,427,true,"Col-0 X-ray callus - FC Col-0 vs. Col-0 Xray",111b,31410901,,21.5900000,,-1.4005051,0.0000000,NO,,1.4099914
SDAAANDVETSGEHNRPDTSSPDWSKR,ph,S,427,true,"atm callus - FC atm vs. atm Xray",111c,31410901,,21.5900000,,0.0334297,0.0000000,NO,,1.4099914
SDAAANDVETSGEHNRPDTSSPDWSKR,ph,S,427,true,"atm-3 X-ray callus - FC atm vs. atm Xray",111d,31410901,,21.5900000,,0.0334297,0.0000000,NO,,1.4099914
SDAAANDVETSGEHNRPDTSSPDWSK,ph,S,427,true,"Large-scale phosphorylation discovery",44,23111157,XCorr,4.8420000,,,,,,
SDAAANDVETSGEHNRPDTSSPDWSK,ph,S,427,true,"srk2dei ABA signaling phopshoproteomics",83,23572148,"MASCOT Score",81.0000000,,,,,,-0.0015000
SDAAANDVETSGEHNRPDTSSPDWSK,ph,S,427,true,"Phospho cell culture sucrose/TOR",109,30833711,,,0.8502640,,,,,
SDAAANDVETSGEHNRPDTSSPDWSK,ph,S,427,true,"Tissue atlas Arabidopsis - ProteomicsDB",114,32188942,"MaxQuant score",349.2500000,0.8817920,,,,0,
YEEEEEEDDDDSRRR,ph,S,526,true,"atm and atr DNA damage response",88,25561503,"MASCOT Score",30.0000000,1.0000000,,,,,0.1700000
ILSGQAAIGSETVQTSPIENDHK,ph,S,591,true,"srk2dei ABA signaling phopshoproteomics",83,23572148,"MASCOT Score",28.0000000,,,,,,-0.0004000
ILSGQAAIGSETVQTSPIENDHK,ph,S,591,true,"Lateral root-induction - NAA vs control",106,23328941,"MASCOT Score",31.0000000,,,,,,
ILSGQAAIGSETVQTSPIENDHK,ph,T,596,true,"srk2dei ABA signaling phopshoproteomics",83,23572148,"MASCOT Score",74.0000000,,,,,,-0.0005000
ILSGQAAIGSETVQTSPIENDHK,ph,T,596,true,"Brassinosteroid-Regulated Phosphorylation Dynamics",94,26187819,"MaxQuant Score",105.0600000,0.7630000,,,,0.0020000000949949,0.2000000
ILSGQAAIGSETVQTSPIENDHK,ph,T,596,true,"Lateral root-induction - NAA vs control",106,23328941,"MASCOT Score",40.0000000,,,,,,
ILSGQAAIGSETVQTSPIENDHK,ph,T,596,true,"Tissue atlas Arabidopsis - ProteomicsDB",114,32188942,"MaxQuant score",266.4400000,0.7615530,,,,0,
ILSGQAAIGSETVQTSPIENDHK,ph,S,597,true,"Phosphoproteome ethylene-regulated time response",46,24043427,"MASCOT Score",31.8600000,,,,,,-5.2428000
ILSGQAAIGSETVQTSPIENDHK,ph,S,597,true,"PAMP-triggered phosphorylation",48,24601666,"MASCOT Score",42.1600000,,,,,,
ILSGQAAIGSETVQTSPIENDHK,ph,S,597,true,"srk2dei ABA signaling phopshoproteomics",83,23572148,"MASCOT Score",94.0000000,,,,,,-0.0004000
ILSGQAAIGSETVQTSPIENDHK,ph,S,597,true,"LAXIC - mannitol vs control",84b,23660473,XCorr,3.8600000,0.9540000,-1.2572025,,NO,6.7100001770182E-12,
ILSGQAAIGSETVQTSPIENDHK,ph,S,597,true,"SnRK2 protein kinase substrates",85,23776212,XCorr,4.5220637,0.9750000,,,,1.0661599471925E-15,
ILSGQAAIGSETVQTSPIENDHK,ph,S,597,true,"atm and atr DNA damage response",88,25561503,"MASCOT Score",38.0000000,0.9950000,,,,,-0.1800000
ILSGQAAIGSETVQTSPIENDHK,ph,S,597,true,"Brassinosteroid-Regulated Phosphorylation Dynamics",94,26187819,"MaxQuant Score",105.0600000,0.8470000,,,,0.0020000000949949,0.4580000
ILSGQAAIGSETVQTSPIENDHK,ph,S,597,true,"TOR Kinase and ABA Receptor",100,29290610,XCorr,5.8833919,0.9890000,,,,6.376000101227E-7,
ILSGQAAIGSETVQTSPIENDHK,ph,S,597,true,"Phospho cell culture sucrose/TOR",109,30833711,,,0.9924160,,,,,
ILSGQAAIGSETVQTSPIENDHK,ph,S,597,true,"Col-0 callus - FC Col-0 vs. Col-0 Xray",111a,31410901,,71.4400000,,0.3135380,0.0000000,NO,,1.5633872
ILSGQAAIGSETVQTSPIENDHK,ph,S,597,true,"Col-0 X-ray callus - FC Col-0 vs. Col-0 Xray",111b,31410901,,71.4400000,,0.3135380,0.0000000,NO,,1.5633872
ILSGQAAIGSETVQTSPIENDHK,ph,S,597,true,"atm callus - FC atm vs. atm Xray",111c,31410901,,71.4400000,,0.8078154,0.0000000,NO,,1.5633872
ILSGQAAIGSETVQTSPIENDHK,ph,S,597,true,"atm-3 X-ray callus - FC atm vs. atm Xray",111d,31410901,,71.4400000,,0.8078154,0.0000000,NO,,1.5633872
ILSGQAAIGSETVQTSPIENDHK,ph,S,597,true,"Tissue atlas Arabidopsis - ProteomicsDB",114,32188942,"MaxQuant score",569.1200000,0.9999520,,,,0,
ATLQTVGESANEHHAADFEENGSGNESMAIDNNSGSEAHAPSK,ph,S,627,true,"Tissue atlas Arabidopsis - ProteomicsDB",114,32188942,"MaxQuant score",101.7700000,0.9330400,,,,1.4932400017823E-34,
LGFGLVGSGKR,ph,S,656,true,"atm and atr DNA damage response",88,25561503,"MASCOT Score",25.0000000,1.0000000,,,,,-1.8800000
LGFGLVGSGKR,ph,S,656,true,"Tissue atlas Arabidopsis - ProteomicsDB",114,32188942,"MaxQuant score",109.1600000,1.0000000,,,,7.0877699727134E-6,
LGFGLVGSGK,ph,S,656,true,"atm and atr DNA damage response",88,25561503,"MASCOT Score",52.0000000,1.0000000,,,,,-3.2300000
LGFGLVGSGKR,ac,K,658,true,"Quantitative Acetylproteomics",101,29440448,,,,,,,,
RTSVPSVFYEEDEDEARK,ph,S,661,true,"TOR Kinase and ABA Receptor",100,29290610,XCorr,4.4761496,0.7692000,,,,0.00025479999021627,
KMKPLVPIDYSTEEQEAVAHGGSGNTPPHLALAAEFAK,ph,S,701,true,"MAPK Arabidopsis substrates",45,23172892,"MaxQuant Score",54.0490000,,,,,,
MKPLVPIDYSTEEQEAVAHGGSGNTPPHLALAAEFAK,ph,S,701,true,"MAPK Arabidopsis substrates",45,23172892,"MaxQuant Score",60.0290000,,,,,,
KMKPLVPIDYSTEEQEAVAHGGSGNTPPHLALAAEFAK,ph,T,704,true,"MAPK Arabidopsis substrates",45,23172892,"MaxQuant Score",75.8870000,,,,,,
MKPLVPIDYSTEEQEAVAHGGSGNTPPHLALAAEFAK,ph,T,704,true,"MAPK Arabidopsis substrates",45,23172892,"MaxQuant Score",49.1520000,,,,,,
MKPLVPIDYSTEEQEAVAHGGSGNTPPHLALAAEFAK,ph,T,704,true,"Tissue atlas Arabidopsis - ProteomicsDB",114,32188942,"MaxQuant score",293.0400000,0.9984890,,,,0,
