Peptide,PTM,ModifiedAA,ModifiedPosition,PeptideUniqueToGene,ExperimentDesc,ExpID,PubmedID,ScoreType,IdentScore,LocProb,Log2FChange,PQ-val,QuantSig,PEP,MassErrorPPM
MDYNPNLPPLGGGGVSMR,nta,M,1,true,"Characterization plant N-terminal acetylation",6,22223895,"MASCOT Score",54.1600000,,,,,,
MDYNPNLPPLGGGGVSMR,nta,M,1,true,"HUNTER N-terminome: legumain, GluC and trypsin",119,31951383,"MaxQuant score",116.5100000,,,,,,
MDYNPNLPPLGGGGVSMR,nta,M,1,true,"Arabidopsis translation initiation landscape - NTA",167a,35069635,,,,,,,,
MDYNPNLPPLG,nta,M,1,true,"Arg/N-end rule seed, prt6 vs. Wt",99,29168982,"MASCOT Score",24.3900000,,,,,0.026690000668168,0.6203264
MDYNPNLPPL,nta,M,1,true,"N-term acetylation drought responses",5,26184543,,,,,,,,
MDYNPNLPPLGGGGVSMRR,ph,S,16,true,"TOR Kinase and ABA Receptor",100,29290610,XCorr,3.0002515,1.0000000,,,,0.001276999944821,
MDYNPNLPPLGGGGVSMRR,ph,S,16,true,"Tissue atlas Arabidopsis - ProteomicsDB",114,32188942,"MaxQuant score",186.3600000,1.0000000,,,,1.3961999799922E-36,
MDYNPNLPPLGGGGVSMR,ph,S,16,true,"atm and atr DNA damage response",88,25561503,"MASCOT Score",38.0000000,1.0000000,,,,,-0.7600000
MDYNPNLPPLGGGGVSMR,ph,S,16,true,"TOR Kinase and ABA Receptor",100,29290610,XCorr,4.7146354,1.0000000,,,,7.3889998475352E-7,
NIEDIFSSGSRR,ph,S,37,true,"Plasmamembrane phosphorylation",20,15308754,,,,,,,,
NIEDIFSSGSR,ph,S,37,true,"Plasmamembrane phosphorylation",20,15308754,,,,,,,,
NIEDIFSSGSR,ph,S,37,true,"atm and atr DNA damage response",88,25561503,"MASCOT Score",35.0000000,1.0000000,,,,,0.0800000
NIEDIFSSGSR,ph,S,37,true,"Lateral root-induction - NAA vs control",106,23328941,"MASCOT Score",22.0000000,,,,,,
NIEDIFSSGSR,ph,S,37,true,"Tissue atlas Arabidopsis - ProteomicsDB",114,32188942,"MaxQuant score",176.9100000,0.9939010,,,,8.5385600940267E-16,
NIEDIFSSGSRR,ph,S,38,true,"srk2dei ABA signaling phopshoproteomics",83,23572148,"MASCOT Score",23.0000000,,,,,,0.0006000
NIEDIFSSGSRR,ph,S,38,true,"atm and atr DNA damage response",88,25561503,"MASCOT Score",60.0000000,0.9430000,,,,,-0.0100000
NIEDIFSSGSRR,ph,S,38,true,"Col-0 callus - FC Col-0 vs. Col-0 Xray",111a,31410901,,36.5400000,,1.3035985,0.0000000,NO,,0.2674031
NIEDIFSSGSRR,ph,S,38,true,"Col-0 X-ray callus - FC Col-0 vs. Col-0 Xray",111b,31410901,,36.5400000,,1.3035985,0.0000000,NO,,0.2674031
NIEDIFSSGSRR,ph,S,38,true,"atm callus - FC atm vs. atm Xray",111c,31410901,,36.5400000,,5.4836278,0.0000000,NO,,0.2674031
NIEDIFSSGSRR,ph,S,38,true,"atm-3 X-ray callus - FC atm vs. atm Xray",111d,31410901,,36.5400000,,5.4836278,0.0000000,NO,,0.2674031
NIEDIFSSGSR,ph,S,38,true,"srk2dei ABA signaling phopshoproteomics",83,23572148,"MASCOT Score",32.0000000,,,,,,0.0008000
NIEDIFSSGSR,ph,S,38,true,"atm and atr DNA damage response",88,25561503,"MASCOT Score",35.0000000,0.9960000,,,,,0.0800000
NIEDIFSSGSR,ph,S,38,true,"Lateral root-induction - NAA vs control",106,23328941,"MASCOT Score",34.0000000,,,,,,
NIEDIFSSGSR,ph,S,38,true,"Tissue atlas Arabidopsis - ProteomicsDB",114,32188942,"MaxQuant score",218.0200000,0.9066740,,,,2.2159399760352E-32,
NIEDIFSSGSRRTQSVNDDEEALK,ph,S,40,true,"Plasmamembrane phosphorylation",20,15308754,,,,,,,,
NIEDIFSSGSRR,ph,S,40,true,"Plasmembrane Ph Immune Responses",25,17651370,,,,,,,,
NIEDIFSSGSRR,ph,S,40,true,"Chloroplast kinase substrates",60,19376835,"MASCOT Score",39.0700000,,,,,,-0.7774600
NIEDIFSSGSRR,ph,S,40,true,"srk2dei ABA signaling phopshoproteomics",83,23572148,"MASCOT Score",24.0000000,,,,,,0.0015000
NIEDIFSSGSRR,ph,S,40,true,"atm and atr DNA damage response",88,25561503,"MASCOT Score",45.0000000,0.9950000,,,,,-0.1700000
NIEDIFSSGSRR,ph,S,40,true,"Tissue atlas Arabidopsis - ProteomicsDB",114,32188942,"MaxQuant score",209.7900000,0.9857730,,,,2.7903099669593E-31,
NIEDIFSSGSR,ph,S,40,true,"Phosphorylation Early Elicitor Signaling",23,17317660,,,,,,,,
NIEDIFSSGSR,ph,S,40,true,"Plasmembrane Ph Immune Responses",25,17651370,,,,,,,,
NIEDIFSSGSR,ph,S,40,true,"ABA-induced protein phosphorylation",35,20733066,,,,,,,,
NIEDIFSSGSR,ph,S,40,true,"srk2dei ABA signaling phopshoproteomics",83,23572148,"MASCOT Score",63.0000000,,,,,,0.0009000
NIEDIFSSGSR,ph,S,40,true,"atm and atr DNA damage response",88,25561503,"MASCOT Score",53.0000000,1.0000000,,,,,-1.6700000
NIEDIFSSGSR,ph,S,40,true,"TOR Kinase and ABA Receptor",100,29290610,XCorr,4.5672140,1.0000000,,,,5.4480001381307E-6,
NIEDIFSSGSR,ph,S,40,true,"Lateral root-induction - NAA vs control",106,23328941,"MASCOT Score",27.0000000,,,,,,
NIEDIFSSGSR,ph,S,40,true,"Phospho cell culture sucrose/TOR",109,30833711,,,0.8084760,,,,,
NIEDIFSSGSRRTQSVNDDEEALK,ph,T,43,true,"Plasmamembrane phosphorylation",20,15308754,,,,,,,,
RTQSVNDDEEALK,ph,T,43,true,"Tissue atlas Arabidopsis - ProteomicsDB",114,32188942,"MaxQuant score",126.6300000,1.0000000,,,,4.5936300807625E-7,
TQSVNDDEEALK,ph,T,43,true,"Plasmamembrane phosphorylation",20,15308754,,,,,,,,
TQSVNDDEEALK,ph,T,43,true,"Lateral root-induction - NAA vs control",106,23328941,"MASCOT Score",31.0000000,,,,,,
NIEDIFSSGSRRTQSVNDDEEALK,ph,S,45,true,"Plasmamembrane phosphorylation",20,15308754,,,,,,,,
TQSVNDDEEALKWAAIEK,ph,S,45,true,"Phosphorylation Early Elicitor Signaling",23,17317660,,,,,,,,
RTQSVNDDEEALK,ph,S,45,true,"atm and atr DNA damage response",88,25561503,"MASCOT Score",64.0000000,1.0000000,,,,,-0.8100000
RTQSVNDDEEALK,ph,S,45,true,"TOR Kinase and ABA Receptor",100,29290610,XCorr,3.2774584,0.9015000,,,,0.00083640002412722,
TQSVNDDEEALK,ph,S,45,true,"Plasmamembrane phosphorylation",20,15308754,,,,,,,,
TQSVNDDEEALK,ph,S,45,true,"Phosphorylation Early Elicitor Signaling",23,17317660,,,,,,,,
TQSVNDDEEALK,ph,S,45,true,"Plasmembrane Ph Immune Responses",25,17651370,,,,,,,,
TQSVNDDEEALK,ph,S,45,true,"STN8 phosphoproteome",38,21768351,"MASCOT Score",44.9800000,,,,,,-0.4563400
TQSVNDDEEALK,ph,S,45,true,"LAXIC - ABA stress",84a,23660473,XCorr,2.8600000,0.9970000,,,,0.053572099655867,
TQSVNDDEEALK,ph,S,45,true,"atm and atr DNA damage response",88,25561503,"MASCOT Score",81.0000000,1.0000000,,,,,-1.5300000
TQSVNDDEEALK,ph,S,45,true,"TOR Kinase and ABA Receptor",100,29290610,XCorr,4.0310707,0.9995000,,,,0.0002667999942787,
TQSVNDDEEALK,ph,S,45,true,"Lateral root-induction - NAA vs control",106,23328941,"MASCOT Score",44.0000000,,0.3325892,0.1967085,NO,,
TQSVNDDEEALK,ph,S,45,true,"Phospho cell culture sucrose/TOR",109,30833711,,,0.9922360,,,,,
TQSVNDDEEALK,ph,S,45,true,"Tissue atlas Arabidopsis - ProteomicsDB",114,32188942,"MaxQuant score",309.7800000,1.0000000,,,,0,
TQSVNDDEEALKWAAIEK,ub,K,54,true,"upl3 mutant / wildtype",168,35926874,"MaxQuant score",83.7580000,1.0000000,-0.2361635,,,4.8277402129315E-6,-0.2306600
WAAIEKLPTYSR,ub,K,60,true,"upl3 mutant / wildtype",168,35926874,"MaxQuant score",88.8030000,1.0000000,-1.4619585,,,0.0004337319987826,-2.1146000
TQSVNDDEEALKWAAIEKLPTYSR,ph,T,63,true,"Tissue atlas Arabidopsis - ProteomicsDB",114,32188942,"MaxQuant score",148.1300000,0.9282160,,,,2.5489619066068E-42,
WAAIEKLPTYSR,ph,T,63,true,"Phosphorylation Early Elicitor Signaling",23,17317660,,,,,,,,
LPTYSR,ph,T,63,false,"srk2dei ABA signaling phopshoproteomics",83,23572148,"MASCOT Score",23.0000000,,,,,,-0.0001000
LPTYSR,ph,T,63,false,"Lateral root-induction - NAA vs control",106,23328941,"MASCOT Score",21.0000000,,-0.0299292,0.8149037,NO,,
LRTTLMNAVVEDDVYGNQLMSK,ph,T,69,true,"TOR Kinase and ABA Receptor",100,29290610,XCorr,5.0605941,0.9003000,,,,3.7939998946968E-6,
LRTTLMNAVVEDDVYGNQLMSK,ph,T,69,true,"Tissue atlas Arabidopsis - ProteomicsDB",114,32188942,"MaxQuant score",110.3100000,0.7867060,,,,7.9528802214389E-16,
TTLMNAVVEDDVYGNQLMSKEVDVTK,ub,K,88,true,"upl3 mutant / wildtype",168,35926874,"MaxQuant score",135.2500000,1.0000000,-1.0619024,0.4247000,NO,5.0419502415329E-25,-0.1837400
EVDVTKLDGEDRQK,ub,K,94,true,"Ubiquitination Membrane Proteins",120,33585938,,,,,,,,
EVDVTKLDGEDR,ub,K,94,true,"Ubiquitination Membrane Proteins",120,33585938,,,,,,,,
EVDVTKLDGEDR,ub,K,94,true,"upl3 mutant / wildtype",168,35926874,"MaxQuant score",142.8300000,1.0000000,-0.4461480,0.6464400,NO,3.5529799102818E-9,1.0878000
QKFIDMVFK,ub,K,102,false,"upl3 mutant / wildtype",168,35926874,"MaxQuant score",74.3760000,1.0000000,-0.0499049,,,0.0031407200731337,0.2793100
QKFIDMVFKVAEQDNER,ub,K,109,false,"Protein ubiquitination during photomorphogenesis",3,28461270,,,,,,,,
FIDMVFKVAEQDNER,ub,K,109,false,"Ubiquitination Membrane Proteins",120,33585938,,,,,,,,
FIDMVFKVAEQDNER,ub,K,109,false,"upl3 mutant / wildtype",168,35926874,"MaxQuant score",59.6730000,1.0000000,0.0703893,0.9381200,NO,0.00043342800927348,0.3148900
VGIKLPTVEVR,ub,K,132,true,"Ubiquitination Membrane Proteins",120,33585938,,,,,,,,
VGIKLPTVEVR,ub,K,132,true,"upl3 mutant / wildtype",168,35926874,"MaxQuant score",108.7000000,1.0000000,-0.5437195,0.4909200,NO,6.2682396674063E-5,0.6501500
ADCYTGNR,sno,C,149,true,"hot5-4 / wildtype, FAT-switch S-nitrosoproteome",169,37277371,,,,-0.2440903,0.1974907,NO,,
SLPTLLNVVR,nt,S,155,true,"N-terminal ChaFRADIC",92,26010716,"MASCOT Score",48.5300000,,,,,0.0001096999985748,
NMGESALGMIGIQFAKK,ub,K,180,true,"Ubiquitination Membrane Proteins",120,33585938,,,,,,,,
CQGVGTR,sno,C,272,false,"hot5-4 / wildtype, FAT-switch S-nitrosoproteome",169,37277371,,,,,,,,
ASAAQGVKNSLVTDYTLK,ac,K,313,true,"Quantitative Acetylproteomics",101,29440448,,,,,,,,
ASAAQGVKNSLVTDYTLK,ub,K,313,true,"Ubiquitination Membrane Proteins",120,33585938,,,,,,,,
YKSFHVGTK,ac,K,485,true,"Quantitative Acetylproteomics",101,29440448,,,,,,,,
YKSFHVGTK,ph,S,486,true,"Tissue atlas Arabidopsis - ProteomicsDB",114,32188942,"MaxQuant score",50.2220000,0.9970230,,,,0.015378500334918,
YKSFHVGTKMSNELAVPFDK,ub,K,492,true,"Ubiquitination Membrane Proteins",120,33585938,,,,,,,,
SFHVGTKMSNELAVPFDK,ub,K,492,true,"Ubiquitination Membrane Proteins",120,33585938,,,,,,,,
SFHVGTKMSNELAVPFDK,ub,K,492,true,"upl3 mutant / wildtype",168,35926874,"MaxQuant score",139.0800000,1.0000000,0.8399596,0.3199200,NO,2.2689700256997E-15,-0.0689240
MSNELAVPFDK,ph,S,494,true,"Plasmamembrane phosphorylation",20,15308754,,,,,,,,
MSNELAVPFDK,ph,S,494,true,"Phosphorylation Early Elicitor Signaling",23,17317660,,,,,,,,
MSNELAVPFDK,ph,S,494,true,"Sucrose-induced phosphorylation",24,17586839,,,,,,,,
MSNELAVPFDK,ph,S,494,true,"Tissue atlas Arabidopsis - ProteomicsDB",114,32188942,"MaxQuant score",130.2700000,1.0000000,,,,1.2993499467484E-6,
MSNELAVPFDKSR,ac,K,503,true,"Quantitative Acetylproteomics",101,29440448,,,,,,,,
SRGHKAALVFDK,ub,K,508,true,"Ubiquitination Membrane Proteins",120,33585938,,,,,,,,
GHKAALVFDK,ub,K,508,true,"Ubiquitination Membrane Proteins",120,33585938,,,,,,,,
GHKAALVFDK,ub,K,508,true,"upl3 mutant / wildtype",168,35926874,"MaxQuant score",111.6300000,1.0000000,0.0949116,0.6961800,NO,0.00042453399510123,1.1822000
AALVFDKYSVSKR,ac,K,520,true,"Quantitative Acetylproteomics",101,29440448,,,,,,,,
SCWDKEWLLMQR,ox,C,527,true,"SPEAR - 50 mM H2O2 / mock",138b,34619326,,,,-4.1790048,0.0100044,YES,,
MASSNSTIK,ng,N,748,true,"Conserved N-glycosylation",74,22633491,"MaxQuant Score",76.1460000,1.0000000,,,,0.0099999997764826,0.7240000
RSLSTADGNR,ph,S,823,true,"atm and atr DNA damage response",88,25561503,"MASCOT Score",28.0000000,1.0000000,,,,,-1.7200000
SLSTADGNR,ph,S,823,true,"atm and atr DNA damage response",88,25561503,"MASCOT Score",52.0000000,1.0000000,,,,,0.1100000
RSLSTADGNR,ph,S,825,true,"atm and atr DNA damage response",88,25561503,"MASCOT Score",50.0000000,0.9270000,,,,,-0.2000000
SLSTADGNRR,ph,S,825,true,"atm and atr DNA damage response",88,25561503,"MASCOT Score",31.0000000,0.9080000,,,,,-0.3100000
SLSTADGNR,ph,S,825,true,"Sucrose-induced phosphorylation",24,17586839,,,,,,,,
SLSTADGNR,ph,S,825,true,"STN8 phosphoproteome",38,21768351,"MASCOT Score",44.7400000,,,,,,0.6656740
SLSTADGNR,ph,S,825,true,"Chloroplast kinase substrates",60,19376835,"MASCOT Score",42.6100000,,,,,,0.6656740
SLSTADGNR,ph,S,825,true,"Phosphorylation in N starvation",63,22060019,"MASCOT Score",99.0000000,,,,,,-4.2933000
SLSTADGNR,ph,S,825,true,"LAXIC - ABA stress",84a,23660473,XCorr,2.6600000,0.9010000,,,,0.019866500049829,
SLSTADGNR,ph,S,825,true,"LAXIC - mannitol vs control",84b,23660473,XCorr,2.6400000,0.9800000,,,,0.026028100401163,
SLSTADGNR,ph,S,825,true,"SnRK2 protein kinase substrates",85,23776212,XCorr,2.9465041,0.9910000,,,,0.032044999301434,
SLSTADGNR,ph,S,825,true,"atm and atr DNA damage response",88,25561503,"MASCOT Score",57.0000000,0.9950000,,,,,0.2200000
SLSTADGNR,ph,S,825,true,"Protein sumoylation and phosphorylation cross-talk",97,28419593,,,,,,,,
SLSTADGNR,ph,S,825,true,"TOR Kinase and ABA Receptor",100,29290610,XCorr,2.7938325,0.9206000,,,,0.00079169997479767,
SLSTADGNR,ph,S,825,true,"Lateral root-induction - NAA vs control",106,23328941,"MASCOT Score",35.0000000,,,,,,
SLSTADGNR,ph,S,825,true,"Phospho cell culture sucrose/TOR",109,30833711,,,0.9641440,,,,,
SLSTADGNR,ph,S,825,true,"Tissue atlas Arabidopsis - ProteomicsDB",114,32188942,"MaxQuant score",178.4600000,0.9998990,,,,1.114080050435E-9,
SLSTADGNRR,ph,T,826,true,"atm and atr DNA damage response",88,25561503,"MASCOT Score",29.0000000,0.9460000,,,,,0.3400000
MSRDSAAEASGGAGNKK,ph,S,841,true,"Tissue atlas Arabidopsis - ProteomicsDB",114,32188942,"MaxQuant score",70.4520000,0.9999380,,,,0.0001740589941619,
MSRDSAAEASGGAGNK,ph,S,841,true,"Plasmamembrane phosphorylation",20,15308754,,,,,,,,
MSRDSAAEASGGAGNK,ph,S,841,true,"atm and atr DNA damage response",88,25561503,"MASCOT Score",32.0000000,1.0000000,,,,,0.4600000
MSRDSAAEASGGAGNKK,ph,S,844,true,"Tissue atlas Arabidopsis - ProteomicsDB",114,32188942,"MaxQuant score",72.8640000,0.9999380,,,,0.00015363600687124,
MSRDSAAEASGGAGNK,ph,S,844,true,"Plasmamembrane phosphorylation",20,15308754,,,,,,,,
MSRDSAAEASGGAGNK,ph,S,844,true,"atm and atr DNA damage response",88,25561503,"MASCOT Score",32.0000000,1.0000000,,,,,0.4600000
DSAAEASGGAGNK,ph,S,849,true,"atm and atr DNA damage response",88,25561503,"MASCOT Score",89.0000000,1.0000000,,,,,-0.4300000
DSAAEASGGAGNKK,ac,K,855,true,"Quantitative Acetylproteomics",101,29440448,,,,,,,,
ISGYCEQTDIHSPQVTVR,sno,C,957,false,"Site-specific nitrosomeproteomic id - gsnor1-3",90a,25699590,XCorr,3.5139875,,,,,1.3410000292424E-6,-5.1503528
ISGYCEQTDIHSPQVTVR,sno,C,957,false,"Site-specific nitrosomeproteomic id - gsnor1-3",90b,25699590,XCorr,3.1800000,,,,,0.003309000050649,-7.7200000
ISGYCEQTDIHSPQVTVR,sno,C,957,false,"hot5-4 / wildtype, FAT-switch S-nitrosoproteome",169,37277371,,,,,,,,
RGGQVIYAGPLGQNSHKVVEYFESFPGVSK,ub,K,1110,true,"Ubiquitination Membrane Proteins",120,33585938,,,,,,,,
GGQVIYAGPLGQNSHKVVEYFESFPGVSK,ub,K,1110,true,"upl3 mutant / wildtype",168,35926874,"MaxQuant score",112.3400000,1.0000000,-0.5820800,,,3.4637301413041E-17,1.2859000
VVEYFESFPGVSKIPEK,ub,K,1123,true,"Ubiquitination Membrane Proteins",120,33585938,,,,,,,,
VVEYFESFPGVSKIPEK,ub,K,1123,true,"upl3 mutant / wildtype",168,35926874,"MaxQuant score",49.5370000,1.0000000,0.2215678,,,0.0013303799787536,-0.4864600
