Peptide,PTM,ModifiedAA,ModifiedPosition,PeptideUniqueToGene,ExperimentDesc,ExpID,PubmedID,ScoreType,IdentScore,LocProb,Log2FChange,PQ-val,QuantSig,PEP,MassErrorPPM
GSVKRKSVEESS,nta,G,2,true,"Arabidopsis translation initiation landscape - NTA",167a,35069635,,,,,,,,
RKSVEESSDSAPPQK,ph,S,8,true,"Tissue atlas Arabidopsis - ProteomicsDB",114,32188942,"MaxQuant score",51.6110000,0.9624480,,,,0.00206896988675,
VIYTSPIKALSNQK,ph,S,117,true,"Conserved plant phosphoproteome - Arabidopsis",61a,20466843,"MASCOT Score",29.0000000,1.0000000,,,,,
VIYTSPIKALSNQK,ph,S,123,true,"Conserved plant phosphoproteome - Arabidopsis",61a,20466843,"MASCOT Score",25.0000000,1.0000000,,,,,
SMQYKGSEIMR,nt,S,162,true,"Arabidopsis translation initiation landscape - NT",167b,35069635,,,,,,,,
GICILMVDEK,so,C,469,true,"S-sulfenylation site detection using YAP1C",110,32714340,,,,,,,,
SLSEDDDSRRPEDANYTVDVLTR,ph,S,629,true,"Tissue atlas Arabidopsis - ProteomicsDB",114,32188942,"MaxQuant score",74.3210000,0.9845840,,,,2.178719995527E-7,
VAEVQLDCK,so,C,895,true,"Arabidopsis S-sulfenylation chemoproteomics",108,31578252,"pFind PSM Score",0.0122293,,,,,,-0.6234895
