Peptide,PTM,ModifiedAA,ModifiedPosition,PeptideUniqueToGene,ExperimentDesc,ExpID,PubmedID,ScoreType,IdentScore,LocProb,Log2FChange,PQ-val,QuantSig,PEP,MassErrorPPM
GGESGAERGGDRGDFGR,me1,R,12,false,"Arabidopsis protein methylome",123,31809900,"MaxQuant Score",86.0160000,0.9968780,,,,1.7105500349501E-10,0.8520300
GGDRGDFGR,me1,R,16,false,"Arabidopsis protein methylome",123,31809900,"MaxQuant Score",72.3250000,1.0000000,,,,0.0012526100035757,-0.0454170
ASEETKWVPVTK,ub,K,52,false,"upl3 mutant / wildtype",168,35926874,"MaxQuant score",151.6600000,1.0000000,0.8326875,0.0763750,NO,3.3616401329262E-10,-0.0269660
WVPVTKLGR,ac,K,58,false,"Quantitative Acetylproteomics",101,29440448,,,,,,,,
WVPVTKLGR,ub,K,58,false,"upl3 mutant / wildtype",168,35926874,"MaxQuant score",62.4630000,1.0000000,1.5250666,0.0084818,YES,0.015027799643576,-0.3473600
ITKLEQIYLHSLPVK,ub,K,70,false,"upl3 mutant / wildtype",168,35926874,"MaxQuant score",156.0000000,1.0000000,0.6088092,0.1969430,NO,2.6554400840106E-16,0.1414700
QIYLHSLPVKE,nt,Q,73,false,"HUNTER N-terminome: legumain, GluC and trypsin",119,31951383,"MaxQuant score",63.2830000,,,,,,
RGYWGNK,me1,R,160,false,"Arabidopsis protein methylome",123,31809900,"MaxQuant Score",49.3580000,1.0000000,,,,0.0084709199145436,-0.2458200
IGKPHTVPCK,so,C,175,false,"S-sulfenylation site detection using YAP1C",110,32714340,,,,,,,,
CGSVTVR,sno,C,181,false,"hot5-4 / wildtype, FAT-switch S-nitrosoproteome",169,37277371,,,,,,,,
CGSVTVR,so,C,181,false,"S-sulfenylation site detection using YAP1C",110,32714340,,,,,,,,
FAGIDDVFTSSR,nt,F,209,false,"Arg/N-end rule seed, prt6 vs. Wt",99,29168982,"MASCOT Score",65.6200000,,,,,0.0029879999347031,-1.8640093
GSTKTLGNFVK,ac,K,224,false,"Quantitative Acetylproteomics",101,29440448,,,,,,,,
TLGNFVKATFDCLQK,hib,K,231,false,"Open search Plant PTM Viewer 2.0 - hib",164e,TBA,,,,,,,,
ATFDCLQK,ox,C,236,false,"OxiTRAQ Arabidopsis - 5 mM H2O2 versus control",47,24376095,,,,-0.1432320,0.3212000,NO,,
ATFDCLQK,ox,C,236,false,"SPEAR - 50 mM H2O2 / mock",138b,34619326,,,,2.9318143,0.0300657,YES,,
ATFDCLQK,sno,C,236,false,"hot5-4 / wildtype, FAT-switch S-nitrosoproteome",169,37277371,,,,0.3111458,0.0034745,NO,,
ATFDCLQK,so,C,236,false,"Arabidopsis S-sulfenylation chemoproteomics",108,31578252,"pFind PSM Score",0.2658680,,0.8474600,,,,-1.5901081
ATFDCLQK,so,C,236,false,"S-sulfenylation site detection using YAP1C",110,32714340,,,,,,,,
LQKTYGFLTPE,nt,L,237,false,"Arg/N-end rule seed, prt6 vs. Wt",99,29168982,"MASCOT Score",47.0700000,,-0.0218043,0.8807413,NO,0.00041840001358651,-5.5703618
TYGFLTPEFWKETR,ub,K,250,false,"upl3 mutant / wildtype",168,35926874,"MaxQuant score",192.1800000,1.0000000,0.8447874,0.2946600,NO,6.0740099824145E-23,0.3748700
SPYQEHTDFLSTKAVSATKVITEGEDQA,nt,S,257,false,"Arabidopsis translation initiation landscape - NT",167b,35069635,,,,,,,,
FSRSPYQEHTDFLSTK,ph,S,257,false,"SnRK2 protein kinase substrates",85,23776212,XCorr,2.1074610,0.9380000,,,,0.028642099350691,
FSRSPYQEHTDFLSTK,ph,S,257,false,"TOR Kinase and ABA Receptor",100,29290610,XCorr,3.4571118,0.9758000,,,,0.00014150000060908,
SPYQEHTDFLSTK,ph,S,257,false,"atm and atr DNA damage response",88,25561503,"MASCOT Score",38.0000000,0.9530000,,,,,0.2800000
SPYQEHTDFLSTK,ph,S,257,false,"Phospho cell culture sucrose/TOR",109,30833711,,,0.9787460,,,,,
SPYQEHTDFLSTK,ph,S,257,false,"Col-0 callus - FC Col-0 vs. Col-0 Xray",111a,31410901,,50.0100000,,0.8158907,0.0000000,NO,,1.1539771
SPYQEHTDFLSTK,ph,S,257,false,"Col-0 X-ray callus - FC Col-0 vs. Col-0 Xray",111b,31410901,,50.0100000,,0.8158907,0.0000000,NO,,1.1539771
SPYQEHTDFLSTK,ph,S,257,false,"atm callus - FC atm vs. atm Xray",111c,31410901,,50.0100000,,0.6443606,0.0000000,NO,,1.1539771
SPYQEHTDFLSTK,ph,S,257,false,"atm-3 X-ray callus - FC atm vs. atm Xray",111d,31410901,,50.0100000,,0.6443606,0.0000000,NO,,1.1539771
SPYQEHTDFLSTK,ph,S,257,false,"Tissue atlas Arabidopsis - ProteomicsDB",114,32188942,"MaxQuant score",245.3600000,1.0000000,,,,0,
SPYQEHTDFLSTKAVSATKVITEGEDQA,ub,K,269,false,"upl3 mutant / wildtype",168,35926874,"MaxQuant score",278.2700000,1.0000000,-0.4779443,0.1837420,NO,0,0.9113500
SPYQEHTDFLSTKAVSATK,ub,K,269,false,"Ubiquitination Membrane Proteins",120,33585938,,,,,,,,
AVSATKVITEGEDQA,nt,A,270,false,"Arg/N-end rule seed, prt6 vs. Wt",99,29168982,"MASCOT Score",51.2500000,,-0.4337442,0.1029889,NO,0.0035059999208897,-0.9808038
AVSATKVITEGEDQA,nt,A,270,false,"Arabidopsis translation initiation landscape - NT",167b,35069635,,,,,,,,
AVSATKVITEGEDQA,ph,S,272,false,"Phosphoproteome ethylene-regulated time response",46,24043427,"MASCOT Score",43.1600000,,,,,,-6.2414000
AVSATKVITEGEDQA,ph,S,272,false,"Tissue atlas Arabidopsis - ProteomicsDB",114,32188942,"MaxQuant score",250.3800000,0.9995650,,,,0,
AVSATKVITEGEDQA,ph,T,274,false,"Tissue atlas Arabidopsis - ProteomicsDB",114,32188942,"MaxQuant score",188.1600000,0.8407730,,,,3.9647399678548E-25,
SPYQEHTDFLSTKAVSATKVITEGEDQA,ub,K,275,false,"upl3 mutant / wildtype",168,35926874,"MaxQuant score",278.2700000,1.0000000,-0.4779443,0.1837420,NO,0,0.9113500
AVSATKVITEGEDQA,ub,K,275,false,"Ubiquitination Membrane Proteins",120,33585938,,,,,,,,
VITEGEDQA,ph,T,278,false,"atm and atr DNA damage response",88,25561503,"MASCOT Score",41.0000000,1.0000000,,,,,0.6800000
VITEGEDQA,ph,T,278,false,"Tissue atlas Arabidopsis - ProteomicsDB",114,32188942,"MaxQuant score",173.0700000,1.0000000,,,,0.00036991600063629,
