Peptide,PTM,ModifiedAA,ModifiedPosition,PeptideUniqueToGene,ExperimentDesc,ExpID,PubmedID,ScoreType,IdentScore,LocProb,Log2FChange,PQ-val,QuantSig,PEP,MassErrorPPM
ELSASSDSASNAASISALEQLKNSAADR,nt,E,62,true,"FtsH12 N-terminome: WT / FtsH12 knockdown miRNA",118,33216923,"MaxQuant score",142.3800000,,-0.3887585,0.0369679,NO,1.110000016732E-16,
ELSASSDSASNAASISALEQLKNSAADR,nt,E,62,true,"HUNTER N-terminome: legumain, GluC and trypsin",119,31951383,"MaxQuant score",174.4000000,,,,,,
ELSASSDSASNAASISALE,nt,E,62,true,"HUNTER N-terminome: legumain, GluC and trypsin",119,31951383,"MaxQuant score",201.0400000,,,,,,
AIAELCGLNHIEEAAVLSTCNR,sno,C,144,false,"hot5-4 / wildtype, FAT-switch S-nitrosoproteome",169,37277371,,,,0.0510786,0.7550187,NO,,
TSGIPVSEICQHR,sno,C,179,false,"hot5-4 / wildtype, FAT-switch S-nitrosoproteome",169,37277371,,,,,,,,
TSGIPVSEICQHR,so,C,179,false,"Arabidopsis S-sulfenylation chemoproteomics",108,31578252,"pFind PSM Score",0.0061745,,1.1199900,,,,0.2141105
HAITVGKR,ac,K,244,false,"Quantitative Acetylproteomics",101,29440448,,,,,,,,
MCVIGAGK,sno,C,282,true,"hot5-4 / wildtype, FAT-switch S-nitrosoproteome",169,37277371,,,,-0.0733047,0.2237048,NO,,
NVGSCVGEVETAR,sno,C,389,true,"hot5-4 / wildtype, FAT-switch S-nitrosoproteome",169,37277371,,,,0.5322840,0.0000698,NO,,
VGEVETAR,nt,V,390,true,"Arg/N-end rule seed, prt6 vs. Wt",99,29168982,"MASCOT Score",40.1300000,,0.2293413,0.3141987,NO,0.048390001058578,-0.7164964
