Peptide,PTM,ModifiedAA,ModifiedPosition,PeptideUniqueToGene,ExperimentDesc,ExpID,PubmedID,ScoreType,IdentScore,LocProb,Log2FChange,PQ-val,QuantSig,PEP,MassErrorPPM
VSTVQSSVATNGSSPAPAPAAVVVER,nt,V,50,true,"HUNTER N-terminome: legumain, GluC and trypsin",119,31951383,"MaxQuant score",85.9250000,,,,,,
VSTVQSSVATNGSSPAPAPAAVVVE,nt,V,50,true,"HUNTER N-terminome: legumain, GluC and trypsin",119,31951383,"MaxQuant score",110.5600000,,,,,,
VSTVQSSVATNGSSPAPAPAAVVVER,nta,V,50,true,"Characterization plant N-terminal acetylation",6,22223895,"MASCOT Score",55.4200000,,,,,,
VSTVQSSVATNGSSPAPAPAAVVVER,nta,V,50,true,"Arg/N-end rule pathway Roots",80,25728785,"MASCOT Score",54.0000000,,,,,0.0026809999253601,
VSTVQSSVATNGSSPAPAPAAVVVER,nta,V,50,true,"HUNTER N-terminome: legumain, GluC and trypsin",119,31951383,"MaxQuant score",126.3600000,,,,,,
VSTVQSSVATNGSSPAPAPAAVVVE,nta,V,50,true,"HUNTER N-terminome: legumain, GluC and trypsin",119,31951383,"MaxQuant score",81.6560000,,,,,,
VSTVQSSVATN,nta,V,50,true,"HUNTER N-terminome: legumain, GluC and trypsin",119,31951383,"MaxQuant score",155.5000000,,,,,,
SVATNGSSPAPAPAAVVVER,nt,S,56,true,"N-terminal ChaFRADIC",92,26010716,"MASCOT Score",54.8600000,,,,,2.1590000898186E-9,
SVATNGSSPAPAPAAVVVE,nt,S,56,true,"HUNTER N-terminome: legumain, GluC and trypsin",119,31951383,"MaxQuant score",77.7540000,,,,,,
GRMAADAIDLLK,mox,M,88,true,"cat2 Methionine oxidation - 3h stress",62b,25693801,"MASCOT Score",43.0000000,,-0.0890427,,NO,,
DCQLFVKQVNPR,ac,K,104,false,"Histone deacetylases substrates - hda14 vs WT",98e,29061669,"MaxQuant Score",73.4000000,1.0000000,0.1980000,0.9120108,NO,9.9999997473788E-5,
QYVAQIPQLPNTEVWFQR,nt,Q,110,false,"HUNTER N-terminome: legumain, GluC and trypsin",119,31951383,"MaxQuant score",85.6360000,,,,,,
