Peptide,PTM,ModifiedAA,ModifiedPosition,PeptideUniqueToGene,ExperimentDesc,ExpID,PubmedID,ScoreType,IdentScore,LocProb,Log2FChange,PQ-val,QuantSig,PEP,MassErrorPPM
VKFTADELRRIMD,nt,V,2,true,"HUNTER N-terminome: legumain, GluC and trypsin",119,31951383,"MaxQuant score",78.3730000,,,,,,
VKFTADELRR,nt,V,2,true,"HUNTER N-terminome: legumain, GluC and trypsin",119,31951383,"MaxQuant score",82.0080000,,,,,,
VKFTADELR,nt,V,2,true,"Arg/N-end rule pathway Roots",80,25728785,"MASCOT Score",48.2100000,,,,,0.00056650000624359,
VKFTADELR,nt,V,2,true,"Stromal N-terminome",96,26371235,"MASCOT Score",54.1800000,,,,,,
VKFTADELR,nt,V,2,true,"HUNTER N-terminome: legumain, GluC and trypsin",119,31951383,"MaxQuant score",107.8300000,,,,,,
VKFTADELR,nt,V,2,true,"Arabidopsis translation initiation landscape - NT",167b,35069635,,,,,,,,
VKFTADELRR,nta,V,2,true,"FtsH12 N-terminome: WT / FtsH12 knockdown miRNA",118,33216923,"MaxQuant score",91.7120000,,,,,3.9599999581696E-6,
VKFTADELR,nta,V,2,true,"FtsH12 N-terminome: WT / FtsH12 knockdown miRNA",118,33216923,"MaxQuant score",126.1000000,,,,,1.379999974301E-16,
VKFTADELRR,ac,K,3,true,"Quantitative Acetylproteomics",101,29440448,,,,,,,,
VKFTADELR,ac,K,3,true,"Quantitative Acetylproteomics",101,29440448,,,,,,,,
VKFTADELR,ub,K,3,true,"Arabidopsis ubiquitination COFRADIC",40,26744219,"MaxQuant Score",77.6620000,1.0000000,,,,0.0020000000949949,0.0460000
IMDYKHNIR,nt,I,12,true,"Arabidopsis translation initiation landscape - NT",167b,35069635,,,,,,,,
DYKHNIRNMSVIAHV,nt,D,14,true,"Arabidopsis translation initiation landscape - NT",167b,35069635,,,,,,,,
RIMDYKHNIR,ac,K,16,true,"Quantitative Acetylproteomics",101,29440448,,,,,,,,
IMDYKHNIR,ac,K,16,true,"Histone deacetylases - apicidin vs control",98a,29061669,"MaxQuant Score",47.2000000,1.0000000,0.0920000,0.6886523,NO,0.0099999997764826,
IMDYKHNIR,ac,K,16,true,"Histone deacetylases- hda14 vs WT (low light)",98c,29061669,"MaxQuant Score",68.3700000,1.0000000,0.0060000,0.9931160,NO,0.019999999552965,
IMDYKHNIR,ac,K,16,true,"Quantitative Acetylproteomics",101,29440448,,,,,,,,
SVIAHVDHGKSTL,nt,S,23,false,"Arabidopsis translation initiation landscape - NT",167b,35069635,,,,,,,,
SLVAAAGIIAQE,nt,S,38,false,"Arabidopsis translation initiation landscape - NT",167b,35069635,,,,,,,,
VAAAGIIAQEVAGDVR,nt,V,40,true,"Arabidopsis translation initiation landscape - NT",167b,35069635,,,,,,,,
AAGIIAQEVAGDVR,nt,A,42,true,"Arg/N-end rule seed, prt6 vs. Wt",99,29168982,"MASCOT Score",60.3300000,,0.0376193,0.8195277,NO,0.0052359998226166,-0.0106806
DGNEYLINLIDSPGHVDFSSEVTAALR,nt,D,94,false,"Arabidopsis translation initiation landscape - NT",167b,35069635,,,,,,,,
ITDGALVVVDCIEGVCVQTETVLR,sno,C,131,false,"hot5-4 / wildtype, FAT-switch S-nitrosoproteome",169,37277371,,,,,,,,
ITDGALVVVDCIEGVCVQTETVLR,so,C,131,false,"S-sulfenylation site detection using YAP1C",110,32714340,,,,,,,,
ITDGALVVVDCIEGVCVQTETVLR,sno,C,136,false,"hot5-4 / wildtype, FAT-switch S-nitrosoproteome",169,37277371,,,,0.0986890,0.8268924,NO,,
ITDGALVVVDCIEGVCVQTETVLR,so,C,136,false,"S-sulfenylation site detection using YAP1C",110,32714340,,,,,,,,
VQTETVLR,nt,V,137,false,"Arg/N-end rule seed, prt6 vs. Wt",99,29168982,"MASCOT Score",49.8700000,,-0.6185849,0.0067270,NO,0.037969999015331,-0.5850886
IRPVLTVNKMDR,ub,K,159,false,"upl3 mutant / wildtype",168,35926874,"MaxQuant score",84.8920000,1.0000000,-0.8008774,0.2063600,NO,0.00020172400400043,-0.0936620
CFLELQVDGEEAYQTFSR,so,C,163,true,"S-sulfenylation site detection using YAP1C",110,32714340,,,,,,,,
NANVIMATYEDPLLGDVQVYPE,nt,N,184,true,"Arabidopsis translation initiation landscape - NT",167b,35069635,,,,,,,,
MYASKFGVVESK,ac,K,232,true,"Histone deacetylases substrates - TSA vs control",98b,29061669,"MaxQuant Score",71.9000000,1.0000000,0.6430000,0.6194411,NO,0.003000000026077,
MYASKFGVVESK,ac,K,232,true,"Histone deacetylases- hda14 vs WT (low light)",98c,29061669,"MaxQuant Score",113.2500000,1.0000000,-1.1010000,0.9885531,NO,0.0007999999797903,
MYASKFGVVESK,ac,K,232,true,"Quantitative Acetylproteomics",101,29440448,,,,,,,,
FGVVESKMMER,ac,K,239,true,"Quantitative Acetylproteomics",101,29440448,,,,,,,,
SGKNTGSPTCKRGF,nt,S,258,true,"Arabidopsis translation initiation landscape - NT",167b,35069635,,,,,,,,
NTGSPTCK,ph,S,264,true,"atm and atr DNA damage response",88,25561503,"MASCOT Score",32.0000000,0.9190000,,,,,-2.1300000
NTGSPTCK,sno,C,267,true,"hot5-4 / wildtype, FAT-switch S-nitrosoproteome",169,37277371,,,,0.8469619,0.0101512,YES,,
TGSPTCK,sno,C,267,true,"hot5-4 / wildtype, FAT-switch S-nitrosoproteome",169,37277371,,,,,,,,
NTGSPTCKR,so,C,267,true,"S-sulfenylation site detection using YAP1C",110,32714340,,,,,,,,
NTGSPTCK,so,C,267,true,"Arabidopsis S-sulfenylation chemoproteomics",108,31578252,"pFind PSM Score",0.0028333,,0.9375800,,,,0.8298696
RGFVQFCYEPIK,so,C,275,true,"S-sulfenylation site detection using YAP1C",110,32714340,,,,,,,,
GFVQFCYEPIK,so,C,275,true,"Arabidopsis S-sulfenylation chemoproteomics",108,31578252,"pFind PSM Score",0.2095860,,0.8673500,,,,1.4009739
QIIATCMNDQK,acy,C,286,true,"Arabidopsis S-acylation atlas - Hypocotyl",163b,35681017,,,,,,,,
QIIATCMNDQK,sno,C,286,true,"Site-specific nitrosomeproteomic id - gsnor1-3",90a,25699590,XCorr,3.1117444,,,,,0.00015029999485705,-5.4452257
QIIATCMNDQK,sno,C,286,true,"hot5-4 / wildtype, FAT-switch S-nitrosoproteome",169,37277371,,,,-0.2946062,0.0011560,NO,,
QIIATCMNDQKDK,so,C,286,true,"Arabidopsis S-sulfenylation chemoproteomics",108,31578252,"pFind PSM Score",0.0058196,,0.7924000,,,,-1.5047576
QIIATCMNDQKDK,so,C,286,true,"S-sulfenylation site detection using YAP1C",110,32714340,,,,,,,,
LGVSMKNDEK,ac,K,306,true,"Quantitative Acetylproteomics",101,29440448,,,,,,,,
ELMGKPLMK,mox,M,313,false,"cat2 Methionine oxidation - 1h stress",62a,25693801,"MASCOT Score",49.0000000,,0.0759669,,NO,,
ELMGKPLMK,mox,M,313,false,"cat2 Methionine oxidation - 3h stress",62b,25693801,"MASCOT Score",42.0000000,,-0.0066125,,NO,,
ELMGKPLMK,mox,M,318,false,"cat2 Methionine oxidation - 1h stress",62a,25693801,"MASCOT Score",49.0000000,,0.0759669,,NO,,
ELMGKPLMK,mox,M,318,false,"cat2 Methionine oxidation - 3h stress",62b,25693801,"MASCOT Score",42.0000000,,-0.0066125,,NO,,
ELMGKPLMKR,ac,K,319,false,"Quantitative Acetylproteomics",101,29440448,,,,,,,,
IFHLPSPHTAQR,nta,I,337,true,"FtsH12 N-terminome: WT / FtsH12 knockdown miRNA",118,33216923,"MaxQuant score",56.2250000,,,,,0.017222000285983,
NLYEGPLDDQYANAIR,nta,N,353,true,"FtsH12 N-terminome: WT / FtsH12 knockdown miRNA",118,33216923,"MaxQuant score",105.4600000,,,,,1.4600000624709E-13,
NCDPNGPLMLYVSK,sno,C,370,true,"Endogenous S-nitrosylation in Arabidopsis",64,22115780,"MASCOT Score",35.0000000,,,,,,
NCDPNGPLMLYVSK,sno,C,370,true,"hot5-4 / wildtype, FAT-switch S-nitrosoproteome",169,37277371,,,,-0.0117075,0.8674575,NO,,
NCDPNGPLMLYVSK,so,C,370,true,"S-sulfenylation site detection using YAP1C",110,32714340,,,,,,,,
VSKMIPASDKGRFF,nt,V,380,false,"Arabidopsis translation initiation landscape - NT",167b,35069635,,,,,,,,
MIPASDKGR,ac,K,389,false,"Quantitative Acetylproteomics",101,29440448,,,,,,,,
KDLYTKSVQR,ac,K,427,true,"Quantitative Acetylproteomics",101,29440448,,,,,,,,
DLYTKSVQR,ac,K,427,true,"Histone deacetylases - apicidin vs control",98a,29061669,"MaxQuant Score",179.5000000,1.0000000,-0.1690000,0.4954502,NO,7.9999999098128E-26,
DLYTKSVQR,ac,K,427,true,"Quantitative Acetylproteomics",101,29440448,,,,,,,,
TVIWMGKR,ac,K,438,true,"Quantitative Acetylproteomics",101,29440448,,,,,,,,
QETVEDVPCGNTVAMVGLDQFITKNATLTNEKEVDAHPIR,nt,Q,440,true,"HUNTER N-terminome: legumain, GluC and trypsin",119,31951383,"MaxQuant score",110.1300000,,,,,,
RQETVEDVPCGNTVAMVGLDQFITK,sno,C,448,true,"Site-specific nitrosomeproteomic id - gsnor1-3",90a,25699590,XCorr,3.5281608,,,,,5.4890001592867E-6,-3.5453360
RQETVEDVPCGNTVAMVGLDQFITK,sno,C,448,true,"Site-specific nitrosomeproteomic id - gsnor1-3",90b,25699590,XCorr,4.2100000,,,,,6.5170002926607E-5,-6.8600000
RQETVEDVPCGNTVAMVGLDQFITK,so,C,448,true,"S-sulfenylation site detection using YAP1C",110,32714340,,,,,,,,
NATLTNEKEVDAHPIR,ac,K,471,true,"Histone deacetylases substrates - hda14 vs WT",98e,29061669,"MaxQuant Score",52.5000000,1.0000000,0.1400000,0.9099133,NO,0.00073000002885237,
NATLTNEKEVDAHPIR,cr,K,471,true,"Open search Plant PTM Viewer 2.0 - Crotonylation",164c,TBA,,,,,,,,
NATLTNEKEVDAHPIR,hib,K,471,true,"Open search Plant PTM Viewer 2.0 - hib",164e,TBA,,,,,,,,
AMKFSVSPVVR,nt,A,480,true,"Stromal N-terminome",96,26371235,"MASCOT Score",35.7900000,,,,,,
AMKFSVSPVVR,nt,A,480,true,"Arabidopsis translation initiation landscape - NT",167b,35069635,,,,,,,,
EVDAHPIRAMK,mox,M,481,true,"cat2 Methionine oxidation - 1h stress",62a,25693801,"MASCOT Score",50.0000000,,0.0933126,,NO,,
AMKFSVSPVVR,ac,K,482,true,"Quantitative Acetylproteomics",101,29440448,,,,,,,,
FSVSPVVR,ph,S,486,true,"Tyrosine phosphorylation in Arabidopsis",59,18463617,"MASCOT Score",25.0000000,,,,,,1.0314920
FSVSPVVR,ph,S,486,true,"Chloroplast kinase substrates",60,19376835,"MASCOT Score",40.5800000,,,,,,0.2631210
FSVSPVVR,ph,S,486,true,"srk2dei ABA signaling phopshoproteomics",83,23572148,"MASCOT Score",37.0000000,,,,,,-0.0007000
FSVSPVVR,ph,S,486,true,"LAXIC - ABA stress",84a,23660473,XCorr,2.2400000,1.0000000,,,,0.022265700623393,
FSVSPVVR,ph,S,486,true,"SnRK2 protein kinase substrates",85,23776212,XCorr,2.3858635,1.0000000,,,,0.054192900657654,
FSVSPVVR,ph,S,486,true,"Phospho cell culture sucrose/TOR",109,30833711,,,0.9999970,,,,,
FSVSPVVR,ph,S,486,true,"Tissue atlas Arabidopsis - ProteomicsDB",114,32188942,"MaxQuant score",126.5500000,0.9999860,,,,0.0029564199503511,
VAVQCK,ox,C,495,true,"OxiTRAQ Arabidopsis - 5 mM H2O2 versus control",47,24376095,,,,0.1768165,0.0698274,NO,,
VAVQCK,sno,C,495,true,"hot5-4 / wildtype, FAT-switch S-nitrosoproteome",169,37277371,,,,0.1644492,0.1812388,NO,,
VAVQCK,so,C,495,true,"Arabidopsis S-sulfenylation chemoproteomics",108,31578252,"pFind PSM Score",0.0303826,,0.9773100,,,,0.7611547
VAVQCK,so,C,495,true,"S-sulfenylation site detection using YAP1C",110,32714340,,,,,,,,
VAVQCKVASDLPK,cr,K,496,true,"Open search Plant PTM Viewer 2.0 - Crotonylation",164c,TBA,,,,,,,,
VASDLPKLVE,nt,V,497,true,"Arg/N-end rule seed, prt6 vs. Wt",99,29168982,"MASCOT Score",22.2700000,,-0.3885328,0.0350310,NO,0.02157000079751,-1.2899403
LVEGLKR,me2,K,509,false,"Arabidopsis protein methylome",123,31809900,"MaxQuant Score",133.4700000,1.0000000,,,,3.4522199143794E-7,0.9450100
LVEGLKR,me3,K,509,false,"Arabidopsis protein methylome",123,31809900,"MaxQuant Score",57.8110000,1.0000000,,,,0.0054417802020907,-0.1605500
SDPMVVCTMEESGEHIVAGAGELHLEICLK,so,C,520,true,"S-sulfenylation site detection using YAP1C",110,32714340,,,,,,,,
ICLKDLQDDFMGGAE,nt,I,540,true,"Arabidopsis translation initiation landscape - NT",167b,35069635,,,,,,,,
SDPMVVCTMEESGEHIVAGAGELHLEICLK,so,C,541,true,"S-sulfenylation site detection using YAP1C",110,32714340,,,,,,,,
DLQDDFMGGAEIIKSDPVVSFR,nt,D,544,true,"Metacaspase9 substrates - Col-0 / mc9",51a,23964026,"MASCOT Score",63.0000000,,1.0530719,,NO,,-1.1144043
DLQDDFMGGAEIIKSDPVVSFR,nt,D,544,true,"Metacaspase9 substrates - 35S:MC9 / mc9",51b,23964026,"MASCOT Score",51.0000000,,1.3203612,,NO,,-1.0951904
DLQDDFMGGAEIIKSDPVVSFR,nt,D,544,true,"Arg/N-end rule pathway Roots",80,25728785,"MASCOT Score",29.0300000,,,,,0.0030620000325143,
DLQDDFMGGAEIIKSDPVVSFR,nt,D,544,true,"Arabidopsis translation initiation landscape - NT",167b,35069635,,,,,,,,
DLQDDFMGGAE,nt,D,544,true,"Arg/N-end rule seed, prt6 vs. Wt",99,29168982,"MASCOT Score",86.3000000,,-0.0139475,0.9537021,NO,3.2039999950939E-6,-1.2424336
SDPVVSFRE,nt,S,558,true,"Arabidopsis translation initiation landscape - NT",167b,35069635,,,,,,,,
SDPVVSFR,nt,S,558,true,"Metacaspase9 substrates - in vitro rMC9",51c,23964026,"MASCOT Score",59.0000000,,2.9835379,,NO,,0.1025113
SDPVVSFR,nt,S,558,true,"Arg/N-end rule seed, prt6 vs. Wt",99,29168982,"MASCOT Score",27.8900000,,0.0893911,0.7946222,NO,0.1731999963522,2.2341278
SDPVVSFR,ph,S,563,true,"Tyrosine phosphorylation in Arabidopsis",59,18463617,"MASCOT Score",27.0000000,,,,,,-0.7103525
SDPVVSFR,ph,S,563,true,"atm and atr DNA damage response",88,25561503,"MASCOT Score",46.0000000,1.0000000,,,,,1.6500000
SDPVVSFR,ph,S,563,true,"Tissue atlas Arabidopsis - ProteomicsDB",114,32188942,"MaxQuant score",104.8200000,1.0000000,,,,0.0043226699344814,
ETVCDR,ox,C,569,true,"OxiTRAQ Arabidopsis - 5 mM H2O2 versus control",47,24376095,,,,0.2545209,0.0898368,NO,,
SDPVVSFRETVCDR,so,C,569,true,"S-sulfenylation site detection using YAP1C",110,32714340,,,,,,,,
ETVCDR,so,C,569,true,"Arabidopsis S-sulfenylation chemoproteomics",108,31578252,"pFind PSM Score",0.0859178,,1.2334000,,,,0.5269871
TVMSKSPNKHNR,nt,T,575,false,"Arabidopsis translation initiation landscape - NT",167b,35069635,,,,,,,,
SKSPNKHNRLYMEARPMEEGLAEAI,nt,S,578,true,"Arabidopsis translation initiation landscape - NT",167b,35069635,,,,,,,,
EEGLAEAIDDGR,nt,E,595,true,"Arg/N-end rule seed, prt6 vs. Wt",99,29168982,"MASCOT Score",37.2300000,,0.0781388,0.9427435,NO,0.062479998916388,-2.0057191
SKILAEEFGWDKDLAK,ub,K,618,false,"upl3 mutant / wildtype",168,35926874,"MaxQuant score",107.6500000,1.0000000,-0.0709665,0.9192600,NO,6.4439497293733E-8,0.2439000
ILAEEFGWDKDLAK,ac,K,628,false,"Histone deacetylases substrates - hda14 vs WT",98e,29061669,"MaxQuant Score",97.7000000,1.0000000,0.0900000,0.9099133,NO,3.4999999426466E-11,
ILAEEFGWDKDLAKK,ac,K,632,false,"Quantitative Acetylproteomics",101,29440448,,,,,,,,
IWAFGPETTGPNMVVDMCK,sno,C,651,true,"Site-specific nitrosomeproteomic id - gsnor1-3",90b,25699590,XCorr,3.2700000,,,,,0.00040779999108054,-6.5200000
IWAFGPETTGPNMVVDMCK,so,C,651,true,"S-sulfenylation site detection using YAP1C",110,32714340,,,,,,,,
SQITAKPRLLEPVYMVE,nt,S,717,true,"Arabidopsis translation initiation landscape - NT",167b,35069635,,,,,,,,
RVIYASQITAKPR,ub,K,722,true,"Ubiquitination Membrane Proteins",120,33585938,,,,,,,,
VIYASQITAKPR,ub,K,722,true,"Arabidopsis ubiquitination COFRADIC",40,26744219,"MaxQuant Score",74.6110000,1.0000000,,,,0.00026810000417754,-0.2690000
VIYASQITAKPR,ub,K,722,true,"upl3 mutant / wildtype",168,35926874,"MaxQuant score",72.2900000,1.0000000,0.1531568,0.8275400,NO,0.001506119966507,-0.1907500
GALGGIYSVLNQKRGHVFEE,nt,G,739,false,"Arabidopsis translation initiation landscape - NT",167b,35069635,,,,,,,,
GIYSVLNQKRGHVFEE,nt,G,743,false,"Arabidopsis translation initiation landscape - NT",167b,35069635,,,,,,,,
QKRGHVFEEMQRPGTPLYN,nt,Q,750,false,"HUNTER N-terminome: legumain, GluC and trypsin",119,31951383,"MaxQuant score",,,,,,,
GHVFEEMQR,nt,G,753,false,"Arabidopsis translation initiation landscape - NT",167b,35069635,,,,,,,,
MQRPGTPLYNIKAYLPVVE,nt,M,759,false,"Arabidopsis translation initiation landscape - NT",167b,35069635,,,,,,,,
GHVFEEMQRPGTPLYNIK,ac,K,770,false,"Quantitative Acetylproteomics",101,29440448,,,,,,,,
MMSSDPLEPGTQASVLVADIR,nt,M,804,true,"Arabidopsis translation initiation landscape - NT",167b,35069635,,,,,,,,
SSDPLEPGTQASVLVADIR,nt,S,806,true,"Arg/N-end rule seed, prt6 vs. Wt",99,29168982,"MASCOT Score",36.3200000,,-0.0176603,0.9832083,NO,0.082659997045994,-2.1185710
SSDPLEPGTQASVLVADIR,nt,S,806,true,"Arabidopsis translation initiation landscape - NT",167b,35069635,,,,,,,,
GLKEAMTPLSEFEDKL,ub,K,830,true,"upl3 mutant / wildtype",168,35926874,"MaxQuant score",58.9800000,1.0000000,,,,0.00059134402545169,-2.0069000
EAMTPLSEFEDKL,ph,T,834,true,"Tissue atlas Arabidopsis - ProteomicsDB",114,32188942,"MaxQuant score",149.0200000,0.9867020,,,,2.7078200792729E-10,
EAMTPLSEFEDKL,ph,S,837,true,"Phosphorylation nuclei-enriched fractions",28,19245862,,,,,,,,
EAMTPLSEFEDKL,ph,S,837,true,"Tyrosine phosphorylation in Arabidopsis",59,18463617,"MASCOT Score",26.0000000,,,,,,-1.2589137
EAMTPLSEFEDKL,ph,S,837,true,"srk2dei ABA signaling phopshoproteomics",83,23572148,"MASCOT Score",35.0000000,,,,,,0.0004000
EAMTPLSEFEDKL,ph,S,837,true,"SnRK2 protein kinase substrates",85,23776212,XCorr,2.6074581,1.0000000,,,,0.014601199887693,
EAMTPLSEFEDKL,ph,S,837,true,"TOR Kinase and ABA Receptor",100,29290610,XCorr,3.3491135,1.0000000,,,,0.0032639999408275,
EAMTPLSEFEDKL,ph,S,837,true,"Tissue atlas Arabidopsis - ProteomicsDB",114,32188942,"MaxQuant score",143.9400000,0.9968960,,,,1.121729951592E-6,
EAMTPLSEFEDK,ph,S,837,true,"TOR Kinase and ABA Receptor",100,29290610,XCorr,2.4876571,1.0000000,,,,0.0035810000263155,
EAMTPLSEFEDKL,ac,K,842,true,"Quantitative Acetylproteomics",101,29440448,,,,,,,,
