Peptide,PTM,ModifiedAA,ModifiedPosition,PeptideUniqueToGene,ExperimentDesc,ExpID,PubmedID,ScoreType,IdentScore,LocProb,Log2FChange,PQ-val,QuantSig,PEP,MassErrorPPM
AFSSLATR,ph,S,257,false,"Tissue atlas Arabidopsis - ProteomicsDB",114,32188942,"MaxQuant score",107.5500000,0.9966410,,,,0.0039196801371872,
AIDSVVCITSK,sno,C,361,true,"hot5-4 / wildtype, FAT-switch S-nitrosoproteome",169,37277371,,,,-0.0137306,0.8013507,NO,,
SADVPTSAAPVPMEIDVDEK,ph,S,682,true,"Tissue atlas Arabidopsis - ProteomicsDB",114,32188942,"MaxQuant score",105.2000000,0.7609610,,,,6.762320037268E-9,
IVCSYLR,so,C,790,true,"Arabidopsis S-sulfenylation chemoproteomics",108,31578252,"pFind PSM Score",0.2534190,,1.0000000,,,,0.1549767
GSASVISELSAADADVLKELGITYK,ph,S,849,true,"Conserved plant phosphoproteome - Arabidopsis",61a,20466843,"MASCOT Score",28.0000000,1.0000000,,,,,
SVDRGSDNSVSASSSTAER,ph,S,891,true,"Tissue atlas Arabidopsis - ProteomicsDB",114,32188942,"MaxQuant score",70.3910000,0.9565270,,,,7.8358301834669E-5,
GSDNSVSASSSTAER,ph,S,896,true,"Tissue atlas Arabidopsis - ProteomicsDB",114,32188942,"MaxQuant score",117.0700000,0.8492510,,,,3.935760105378E-6,
GSDNSVSASSSTAERESDEDSSNALAVR,ph,S,906,true,"PAMP-triggered phosphorylation",48,24601666,"MASCOT Score",35.0900000,,,,,,
GSDNSVSASSSTAERESDEDSSNALAVR,ph,S,906,true,"LAXIC - ABA stress",84a,23660473,XCorr,4.5200000,0.8490000,,,,4.6400000996982E-7,
GSDNSVSASSSTAERESDEDSSNALAVR,ph,S,906,true,"SnRK2 protein kinase substrates",85,23776212,XCorr,4.3991170,0.9930000,,,,1.9702000447763E-12,
GSDNSVSASSSTAERESDEDSSNALAVR,ph,S,906,true,"TOR Kinase and ABA Receptor",100,29290610,XCorr,5.0318775,0.9972000,,,,2.0090000418804E-7,
GSDNSVSASSSTAERESDEDSSNALAVR,ph,S,906,true,"Phospho cell culture sucrose/TOR",109,30833711,,,0.9366850,,,,,
GSDNSVSASSSTAERESDEDSSNALAVR,ph,S,906,true,"Col-0 callus - FC Col-0 vs. Col-0 Xray",111a,31410901,,31.6300000,,0.7488467,0.0000000,NO,,1.0088581
GSDNSVSASSSTAERESDEDSSNALAVR,ph,S,906,true,"Col-0 X-ray callus - FC Col-0 vs. Col-0 Xray",111b,31410901,,31.6300000,,0.7488467,0.0000000,NO,,1.0088581
GSDNSVSASSSTAERESDEDSSNALAVR,ph,S,906,true,"atm callus - FC atm vs. atm Xray",111c,31410901,,31.6300000,,0.4055556,0.0000000,NO,,1.0088581
GSDNSVSASSSTAERESDEDSSNALAVR,ph,S,906,true,"atm-3 X-ray callus - FC atm vs. atm Xray",111d,31410901,,31.6300000,,0.4055556,0.0000000,NO,,1.0088581
ESDEDSSNALAVR,ph,S,906,false,"Tissue atlas Arabidopsis - ProteomicsDB",114,32188942,"MaxQuant score",269.9000000,1.0000000,,,,0,
ESDEDSSNALAVR,ph,S,910,false,"Tissue atlas Arabidopsis - ProteomicsDB",114,32188942,"MaxQuant score",190.3400000,0.9610460,,,,3.2523099977647E-30,
YTNPVSIR,ph,S,923,false,"Tissue atlas Arabidopsis - ProteomicsDB",114,32188942,"MaxQuant score",112.1300000,1.0000000,,,,0.0035341801121831,
SSSSQSIWGGDR,ph,S,928,true,"atm and atr DNA damage response",88,25561503,"MASCOT Score",51.0000000,0.8830000,,,,,-0.6800000
SSSSQSIWGGDR,ph,S,928,true,"Tissue atlas Arabidopsis - ProteomicsDB",114,32188942,"MaxQuant score",138.2000000,0.9982010,,,,1.4794100025028E-5,
HLESFNFDSEIPADLPVTSSSHELK,ph,S,971,false,"Tissue atlas Arabidopsis - ProteomicsDB",114,32188942,"MaxQuant score",151.3700000,0.9998890,,,,1.9618178500547E-44,
HLESFNFDSEIPADLPVTSSSHELK,ph,S,987,false,"PAMP-triggered phosphorylation",48,24601666,"MASCOT Score",33.0900000,,,,,,
HLESFNFDSEIPADLPVTSSSHELK,ph,S,987,false,"Col-0 callus - FC Col-0 vs. Col-0 Xray",111a,31410901,,47.3400000,,0.6980406,0.0000000,NO,,-0.0880148
HLESFNFDSEIPADLPVTSSSHELK,ph,S,987,false,"Col-0 X-ray callus - FC Col-0 vs. Col-0 Xray",111b,31410901,,47.3400000,,0.6980406,0.0000000,NO,,-0.0880148
HLESFNFDSEIPADLPVTSSSHELK,ph,S,987,false,"atm callus - FC atm vs. atm Xray",111c,31410901,,47.3400000,,1.7247095,0.0000000,NO,,-0.0880148
HLESFNFDSEIPADLPVTSSSHELK,ph,S,987,false,"atm-3 X-ray callus - FC atm vs. atm Xray",111d,31410901,,47.3400000,,1.7247095,0.0000000,NO,,-0.0880148
HLESFNFDSEIPADLPVTSSSHELK,ph,S,987,false,"Tissue atlas Arabidopsis - ProteomicsDB",114,32188942,"MaxQuant score",220.6300000,0.7688780,,,,0,
LNCTLR,sno,C,1009,false,"hot5-4 / wildtype, FAT-switch S-nitrosoproteome",169,37277371,,,,,,,,
NIWSHSKWLVDTLQNYCR,ub,K,1150,true,"Ubiquitylome analysis innate immunity",124,33793954,,,,,,,,
LSSEYVEGNQGGSLVPSDSPQDSTAALKDALSSDVAK,ph,S,1509,true,"Tissue atlas Arabidopsis - ProteomicsDB",114,32188942,"MaxQuant score",165.0100000,0.9204550,,,,0,
LSSEYVEGNQGGSLVPSDSPQDSTAALK,ph,S,1509,true,"TOR Kinase and ABA Receptor",100,29290610,XCorr,4.2617750,0.8281000,,,,9.0449997514952E-5,
DALSSDVAK,ph,S,1522,false,"atm and atr DNA damage response",88,25561503,"MASCOT Score",44.0000000,0.9590000,,,,,-1.3300000
DALSSDVAK,ph,S,1522,false,"Tissue atlas Arabidopsis - ProteomicsDB",114,32188942,"MaxQuant score",68.5360000,0.7956300,,,,0.011719799600542,
DALSSDVAK,ph,S,1523,false,"Tissue atlas Arabidopsis - ProteomicsDB",114,32188942,"MaxQuant score",78.5130000,0.9310720,,,,0.0052116899751127,
AVASTCQLESSGGR,sno,C,1678,true,"hot5-4 / wildtype, FAT-switch S-nitrosoproteome",169,37277371,,,,,,,,
VSGSEHGFSLNEPLGISENK,ph,S,1701,false,"Lateral root-induction - NAA vs control",106,23328941,"MASCOT Score",23.0000000,,,,,,
VSGSEHGFSLNEPLGISENK,ph,S,1701,false,"Phospho cell culture sucrose/TOR",109,30833711,,,0.8442220,,,,,
VSGSEHGFSLNEPLGISENK,ph,S,1701,false,"Tissue atlas Arabidopsis - ProteomicsDB",114,32188942,"MaxQuant score",296.5300000,0.9524670,,,,0,
VSGSEHGFSLNEPLGISENK,ph,S,1703,false,"PAMP-triggered phosphorylation",48,24601666,"MASCOT Score",58.5600000,,,,,,
VSGSEHGFSLNEPLGISENK,ph,S,1703,false,"srk2dei ABA signaling phopshoproteomics",83,23572148,"MASCOT Score",60.0000000,,,,,,-0.0001000
VSGSEHGFSLNEPLGISENK,ph,S,1703,false,"SnRK2 protein kinase substrates",85,23776212,XCorr,4.1899419,0.9330000,,,,1.6121299850624E-9,
VSGSEHGFSLNEPLGISENK,ph,S,1703,false,"atm and atr DNA damage response",88,25561503,"MASCOT Score",29.0000000,0.9930000,,,,,-0.6500000
VSGSEHGFSLNEPLGISENK,ph,S,1703,false,"Lateral root-induction - NAA vs control",106,23328941,"MASCOT Score",39.0000000,,0.0983091,0.7486836,NO,,
VSGSEHGFSLNEPLGISENK,ph,S,1703,false,"Phospho cell culture sucrose/TOR",109,30833711,,,0.9281440,,,,,
VSGSEHGFSLNEPLGISENK,ph,S,1703,false,"Col-0 callus - FC Col-0 vs. Col-0 Xray",111a,31410901,,88.1700000,,0.8524685,0.0392571,YES,,0.9862561
VSGSEHGFSLNEPLGISENK,ph,S,1703,false,"Col-0 X-ray callus - FC Col-0 vs. Col-0 Xray",111b,31410901,,88.1700000,,0.8524685,0.0392571,YES,,0.9862561
VSGSEHGFSLNEPLGISENK,ph,S,1703,false,"atm callus - FC atm vs. atm Xray",111c,31410901,,88.1700000,,1.0763714,0.5049813,NO,,0.9862561
VSGSEHGFSLNEPLGISENK,ph,S,1703,false,"atm-3 X-ray callus - FC atm vs. atm Xray",111d,31410901,,88.1700000,,1.0763714,0.5049813,NO,,0.9862561
VSGSEHGFSLNEPLGISENK,ph,S,1703,false,"Tissue atlas Arabidopsis - ProteomicsDB",114,32188942,"MaxQuant score",494.7600000,0.9997500,,,,0,
VSGSEHGFSLNEPLGISENK,ph,S,1708,false,"srk2dei ABA signaling phopshoproteomics",83,23572148,"MASCOT Score",51.0000000,,,,,,0.0009000
VSGSEHGFSLNEPLGISENK,ph,S,1708,false,"LAXIC - ABA stress",84a,23660473,XCorr,4.6300000,0.8790000,,,,1.2799999922208E-6,
VSGSEHGFSLNEPLGISENK,ph,S,1708,false,"LAXIC - mannitol vs control",84b,23660473,XCorr,5.0400000,0.9320000,,,,6.6599998356943E-16,
VSGSEHGFSLNEPLGISENK,ph,S,1708,false,"Lateral root-induction - NAA vs control",106,23328941,"MASCOT Score",25.0000000,,0.0989369,0.7467131,NO,,
VSGSEHGFSLNEPLGISENK,ph,S,1708,false,"Col-0 callus - FC Col-0 vs. Col-0 Xray",111a,31410901,,49.7200000,,3.1063733,0.0000000,NO,,0.3717564
VSGSEHGFSLNEPLGISENK,ph,S,1708,false,"Col-0 X-ray callus - FC Col-0 vs. Col-0 Xray",111b,31410901,,49.7200000,,3.1063733,0.0000000,NO,,0.3717564
VSGSEHGFSLNEPLGISENK,ph,S,1708,false,"atm callus - FC atm vs. atm Xray",111c,31410901,,49.7200000,,0.1450370,0.0000000,NO,,0.3717564
VSGSEHGFSLNEPLGISENK,ph,S,1708,false,"atm-3 X-ray callus - FC atm vs. atm Xray",111d,31410901,,49.7200000,,0.1450370,0.0000000,NO,,0.3717564
VSGSEHGFSLNEPLGISENK,ph,S,1708,false,"Tissue atlas Arabidopsis - ProteomicsDB",114,32188942,"MaxQuant score",83.7010000,0.9522950,,,,1.397239990375E-9,
VGEPEKASSSR,ph,S,1790,true,"Tissue atlas Arabidopsis - ProteomicsDB",114,32188942,"MaxQuant score",68.1730000,0.7896300,,,,0.0011299100005999,
GSNLPDDSPGNGGLIYHVIHR,ph,S,1852,false,"Tissue atlas Arabidopsis - ProteomicsDB",114,32188942,"MaxQuant score",157.9000000,1.0000000,,,,6.068829821205E-30,
GSSQTQAMPQDMR,ph,S,2081,true,"atm and atr DNA damage response",88,25561503,"MASCOT Score",29.0000000,0.9530000,,,,,-1.1400000
GSSQTQAMPQDMR,ph,S,2082,true,"atm and atr DNA damage response",88,25561503,"MASCOT Score",39.0000000,1.0000000,,,,,-1.0600000
GSSQTQAMPQDMR,ph,S,2082,true,"Tissue atlas Arabidopsis - ProteomicsDB",114,32188942,"MaxQuant score",115.0900000,0.9888380,,,,2.1780899260193E-5,
SGSEVHGFQHPLFSR,ph,S,2265,false,"atm and atr DNA damage response",88,25561503,"MASCOT Score",61.0000000,0.8950000,,,,,-0.3100000
SGSEVHGFQHPLFSR,ph,S,2265,false,"Phospho cell culture sucrose/TOR",109,30833711,,,0.9219390,,,,,
SGSEVHGFQHPLFSR,ph,S,2265,false,"Tissue atlas Arabidopsis - ProteomicsDB",114,32188942,"MaxQuant score",180.0800000,0.9985740,,,,0,
PSQTGNTASVSASAGSISR,ph,S,2286,false,"Tissue atlas Arabidopsis - ProteomicsDB",114,32188942,"MaxQuant score",207.3700000,0.9877970,,,,0,
PSQTGNTASVSASAGSISR,ph,S,2288,false,"atm and atr DNA damage response",88,25561503,"MASCOT Score",38.0000000,0.9070000,,,,,0.4800000
PSQTGNTASVSASAGSISR,ph,S,2290,false,"atm and atr DNA damage response",88,25561503,"MASCOT Score",68.0000000,1.0000000,,,,,0.0400000
PSQTGNTASVSASAGSISR,ph,S,2293,false,"atm and atr DNA damage response",88,25561503,"MASCOT Score",68.0000000,0.9990000,,,,,0.0400000
PSQTGNTASVSASAGSISR,ph,S,2293,false,"Tissue atlas Arabidopsis - ProteomicsDB",114,32188942,"MaxQuant score",324.2300000,0.9953840,,,,0,
PSQTGNTASVSASAGSISR,ph,S,2295,false,"atm and atr DNA damage response",88,25561503,"MASCOT Score",54.0000000,0.9950000,,,,,0.0200000
GESLQQLEVMQPLPLNSTPNEIDR,nt,G,2472,true,"HUNTER N-terminome: legumain, GluC and trypsin",119,31951383,"MaxQuant score",56.5290000,,,,,,
NDEQVEEGSLDGR,ph,S,2598,true,"STN8 phosphoproteome",38,21768351,"MASCOT Score",81.2000000,,,,,,-0.8611670
NDEQVEEGSLDGR,ph,S,2598,true,"Tyrosine phosphorylation in Arabidopsis",59,18463617,"MASCOT Score",36.0000000,,,,,,-0.5895502
NDEQVEEGSLDGR,ph,S,2598,true,"Chloroplast kinase substrates",60,19376835,"MASCOT Score",61.9400000,,,,,,-3.2293400
NDEQVEEGSLDGR,ph,S,2598,true,"LAXIC - mannitol vs control",84b,23660473,XCorr,4.2700000,1.0000000,-1.0155548,,NO,6.4899999415502E-5,
NDEQVEEGSLDGR,ph,S,2598,true,"SnRK2 protein kinase substrates",85,23776212,XCorr,3.6905663,1.0000000,,,,0.0045040701515973,
NDEQVEEGSLDGR,ph,S,2598,true,"atm and atr DNA damage response",88,25561503,"MASCOT Score",78.0000000,1.0000000,,,,,-0.2100000
NDEQVEEGSLDGR,ph,S,2598,true,"Lateral root-induction - NAA vs control",106,23328941,"MASCOT Score",56.0000000,,,,,,
NDEQVEEGSLDGR,ph,S,2598,true,"Phospho cell culture sucrose/TOR",109,30833711,,,1.0000000,,,,,
NDEQVEEGSLDGR,ph,S,2598,true,"Col-0 callus - FC Col-0 vs. Col-0 Xray",111a,31410901,,58.2400000,,-0.0971911,0.0000000,NO,,0.6322162
NDEQVEEGSLDGR,ph,S,2598,true,"Col-0 X-ray callus - FC Col-0 vs. Col-0 Xray",111b,31410901,,58.2400000,,-0.0971911,0.0000000,NO,,0.6322162
NDEQVEEGSLDGR,ph,S,2598,true,"atm callus - FC atm vs. atm Xray",111c,31410901,,58.2400000,,-0.8074004,0.0000000,NO,,0.6322162
NDEQVEEGSLDGR,ph,S,2598,true,"atm-3 X-ray callus - FC atm vs. atm Xray",111d,31410901,,58.2400000,,-0.8074004,0.0000000,NO,,0.6322162
NDEQVEEGSLDGR,ph,S,2598,true,"Tissue atlas Arabidopsis - ProteomicsDB",114,32188942,"MaxQuant score",278.8200000,1.0000000,,,,0,
SSVFGSSHR,ph,S,2740,true,"atm and atr DNA damage response",88,25561503,"MASCOT Score",44.0000000,0.9610000,,,,,0.6900000
SSVFGSSHR,ph,S,2740,true,"Tissue atlas Arabidopsis - ProteomicsDB",114,32188942,"MaxQuant score",143.2400000,0.9977800,,,,8.9540801127441E-5,
VFGSSHR,ph,S,2740,false,"Tissue atlas Arabidopsis - ProteomicsDB",114,32188942,"MaxQuant score",88.8190000,0.8266690,,,,0.01811490021646,
SSVFGSSHR,ph,S,2741,true,"Tissue atlas Arabidopsis - ProteomicsDB",114,32188942,"MaxQuant score",101.3500000,0.9975770,,,,0.0010697500547394,
VFGSSHR,ph,S,2741,false,"Tissue atlas Arabidopsis - ProteomicsDB",114,32188942,"MaxQuant score",102.6200000,0.8665200,,,,0.01811490021646,
AVSSSADGLK,ph,S,2773,true,"atm and atr DNA damage response",88,25561503,"MASCOT Score",46.0000000,1.0000000,,,,,-0.6900000
AVSSSADGLK,ph,S,2773,true,"Tissue atlas Arabidopsis - ProteomicsDB",114,32188942,"MaxQuant score",100.5500000,0.9950140,,,,0.00041762000182644,
AVSSSADGLK,ph,S,2775,true,"Tissue atlas Arabidopsis - ProteomicsDB",114,32188942,"MaxQuant score",79.2860000,0.9205400,,,,0.0031727799214423,
LENKPVGEEASSETRK,ph,T,2997,true,"TOR Kinase and ABA Receptor",100,29290610,XCorr,3.6578379,0.9808000,,,,0.020320000126958,
KDAESELVGEADLSVAR,ph,S,3003,true,"Tissue atlas Arabidopsis - ProteomicsDB",114,32188942,"MaxQuant score",229.6800000,1.0000000,,,,0,
DAESELVGEADLSVAR,ph,S,3012,true,"Tissue atlas Arabidopsis - ProteomicsDB",114,32188942,"MaxQuant score",53.3950000,0.9999700,,,,0.0033279100898653,
QKMSRSTGSMAGASILR,ub,K,3099,true,"Arabidopsis ubiquitination by TUBEs",2,23667124,,,,,,,,
MRSPQDLK,ph,S,3340,false,"atm and atr DNA damage response",88,25561503,"MASCOT Score",27.0000000,1.0000000,,,,,-1.8000000
MRSPQDLK,ph,S,3340,false,"Tissue atlas Arabidopsis - ProteomicsDB",114,32188942,"MaxQuant score",82.4520000,1.0000000,,,,0.015576199628413,
FLQFVTGTSKVPLEGFK,ub,K,3612,false,"upl3 mutant / wildtype",168,35926874,"MaxQuant score",68.8450000,1.0000000,-0.3022262,0.5596800,NO,7.6308897405397E-5,-2.1076000
LPSAHTCFNQLDLPEYQSK,so,C,3648,false,"Arabidopsis S-sulfenylation chemoproteomics",108,31578252,"pFind PSM Score",0.0964863,,,,,,-0.4311702
