Peptide,PTM,ModifiedAA,ModifiedPosition,PeptideUniqueToGene,ExperimentDesc,ExpID,PubmedID,ScoreType,IdentScore,LocProb,Log2FChange,PQ-val,QuantSig,PEP,MassErrorPPM
YIESLPTSGSCSWK,ph,S,823,true,"Phosphorylation Early Elicitor Signaling",23,17317660,,,,,,,,
YIESLPTSGSCSWK,ph,S,823,true,"Tissue atlas Arabidopsis - ProteomicsDB",114,32188942,"MaxQuant score",173.4400000,0.7997080,,,,6.0937101354559E-16,
ITGQGDREFMAEMETIGK,ph,T,893,true,"Tissue atlas Arabidopsis - ProteomicsDB",114,32188942,"MaxQuant score",52.8980000,0.9999770,,,,0.0010881300549954,
GAEILDPELVTDKSGDVELFHYLK,ph,S,1101,true,"Plasmamembrane phosphorylation",20,15308754,,,,,,,,
SGDVELFHYLK,ph,S,1101,true,"TOR Kinase and ABA Receptor",100,29290610,XCorr,3.5963135,1.0000000,,,,0.0013559999642894,
SGDVELFHYLK,ph,S,1101,true,"Tissue atlas Arabidopsis - ProteomicsDB",114,32188942,"MaxQuant score",203.6100000,1.0000000,,,,0,
EMKADTEEDESLDEFSLK,ph,T,1141,true,"Tissue atlas Arabidopsis - ProteomicsDB",114,32188942,"MaxQuant score",372.7600000,1.0000000,,,,0,
ADTEEDESLDEFSLK,ph,S,1146,true,"Tissue atlas Arabidopsis - ProteomicsDB",114,32188942,"MaxQuant score",357.3400000,1.0000000,,,,0,
ADTEEDESLDEFSLKETPLVEESR,ph,T,1155,true,"Tissue atlas Arabidopsis - ProteomicsDB",114,32188942,"MaxQuant score",166.9700000,0.9914220,,,,0,
