Peptide,PTM,ModifiedAA,ModifiedPosition,PeptideUniqueToGene,ExperimentDesc,ExpID,PubmedID,ScoreType,IdentScore,LocProb,Log2FChange,PQ-val,QuantSig,PEP,MassErrorPPM
SVSGSGVASSYSK,og,S,188,true,"O-GlcNac Inflorescence Tissue",81,28154133,"MASCOT Score",30.2000000,,,,,,-0.4400000
SVSGSGVASSYSK,og,S,190,true,"O-GlcNac Inflorescence Tissue",81,28154133,"MASCOT Score",38.6000000,,,,,,0.6900000
SVSGSGVASSYSK,ph,S,190,true,"Tissue atlas Arabidopsis - ProteomicsDB",114,32188942,"MaxQuant score",90.2290000,0.9977820,,,,0.00040877898572944,
SVSGSGVASSYSK,og,S,192,true,"O-GlcNac Inflorescence Tissue",81,28154133,"MASCOT Score",39.1000000,,,,,,0.8300000
SVSGSGVASSYSKANNNVPATR,ub,K,200,true,"Arabidopsis ubiquitination COFRADIC",40,26744219,"MaxQuant Score",58.0930000,1.0000000,,,,1.1980000325096E-13,0.9480000
NQNSSSNSHYTSMYQPASMTGYAAQGYYDRVSPNK,ph,S,241,true,"TOR Kinase and ABA Receptor",100,29290610,XCorr,3.5918968,0.9953000,,,,0.00051390001317486,
VSPNKSYGQYGSTVR,ph,S,241,true,"Tissue atlas Arabidopsis - ProteomicsDB",114,32188942,"MaxQuant score",152.7900000,0.9998280,,,,0,
GRGNSYFYGNENIDGLNELNR,me1,R,285,true,"Arabidopsis protein methylome",123,31809900,"MaxQuant Score",189.1100000,1.0000000,,,,0,-0.2488500
ATEEVSSEEVKK,ph,S,319,true,"Tissue atlas Arabidopsis - ProteomicsDB",114,32188942,"MaxQuant score",128.4600000,0.8868050,,,,2.8729200494126E-5,
LDAAYQEAQQK,nt,L,390,true,"Arabidopsis translation initiation landscape - NT",167b,35069635,,,,,,,,
