Peptide,PTM,ModifiedAA,ModifiedPosition,PeptideUniqueToGene,ExperimentDesc,ExpID,PubmedID,ScoreType,IdentScore,LocProb,Log2FChange,PQ-val,QuantSig,PEP,MassErrorPPM
LSSSSFGR,ph,S,34,true,"Tissue atlas Arabidopsis - ProteomicsDB",114,32188942,"MaxQuant score",103.2600000,0.9766870,,,,0.0045834500342607,
AAKELHFNKDGTTIRRL,nt,A,55,true,"Arabidopsis translation initiation landscape - NT",167b,35069635,,,,,,,,
AAKELHFNKDGTTIR,nt,A,55,false,"Arg/N-end rule pathway Roots",80,25728785,"MASCOT Score",64.0400000,,,,,8.646999776829E-5,
AAKELHFNKDGTTIR,nt,A,55,false,"Stromal N-terminome",96,26371235,"MASCOT Score",34.6100000,,,,,,
AAKELHFNKDGTTIR,nt,A,55,false,"FtsH12 N-terminome: WT / FtsH12 knockdown miRNA",118,33216923,"MaxQuant score",49.9290000,,,,,0.005226599983871,
AAKELHFNKDGTTIR,nt,A,55,false,"HUNTER N-terminome: legumain, GluC and trypsin",119,31951383,"MaxQuant score",146.7600000,,,,,,
AKELHFNKDGTTIR,nta,A,56,false,"FtsH12 N-terminome: WT / FtsH12 knockdown miRNA",118,33216923,"MaxQuant score",60.5090000,,,,,0.019035000354052,
ELHFNKDGTTIR,ac,K,63,false,"Histone deacetylases substrates - TSA vs control",98b,29061669,"MaxQuant Score",64.3000000,1.0000000,0.1240000,0.9977001,NO,0.00039999998989515,
ELHFNKDGTTIR,ac,K,63,false,"Quantitative Acetylproteomics",101,29440448,,,,,,,,
AGVNKLADLVGVTLGPKGR,nt,A,73,false,"Stromal N-terminome",96,26371235,"MASCOT Score",53.2700000,,,,,,
LADLVGVTLGPKGR,nt,L,78,false,"Stromal N-terminome",96,26371235,"MASCOT Score",41.2500000,,,,,,
LADLVGVTLGPKGR,ac,K,89,false,"Quantitative Acetylproteomics",101,29440448,,,,,,,,
NVVLESKYGSPR,ac,K,98,false,"Histone deacetylases - apicidin vs control",98a,29061669,"MaxQuant Score",88.1000000,1.0000000,0.1790000,0.5445027,NO,2.6999998681276E-7,
NVVLESKYGSPR,ac,K,98,false,"Histone deacetylases substrates - TSA vs control",98b,29061669,"MaxQuant Score",88.1000000,1.0000000,-0.0020000,0.9977001,NO,2.6999998681276E-7,
NVVLESKYGSPR,ac,K,98,false,"Histone deacetylases substrates - hda14 vs WT",98e,29061669,"MaxQuant Score",88.1000000,1.0000000,0.6330000,0.2517677,NO,6.4999999267457E-6,
EVELEDPVENIGAKLVR,nt,E,114,false,"Metacaspase9 substrates - Col-0 / mc9",51a,23964026,"MASCOT Score",55.0000000,,3.1841684,,NO,,-1.2152861
EVELEDPVENIGAKLVR,nt,E,114,false,"Metacaspase9 substrates - 35S:MC9 / mc9",51b,23964026,"MASCOT Score",58.0000000,,3.6692754,,NO,,-1.2152861
EVELEDPVENIGAKLVR,nt,E,114,false,"Stromal N-terminome",96,26371235,"MASCOT Score",49.3500000,,,,,,
EVELEDPVENIGAKLVR,nt,E,114,false,"Arabidopsis translation initiation landscape - NT",167b,35069635,,,,,,,,
EVELEDPVENIGAKLVR,ub,K,127,false,"Arabidopsis ubiquitination COFRADIC",40,26744219,"MaxQuant Score",123.0200000,1.0000000,,,,1.5430000018837E-29,0.1500000
DLAGDGTTTSVVLAQGFIAE,nt,D,138,false,"Arg/N-end rule seed, prt6 vs. Wt",99,29168982,"MASCOT Score",21.1500000,,-0.9190801,0.0762136,NO,0.00027210000553168,0.9343277
ALVTELKK,ac,K,187,true,"Quantitative Acetylproteomics",101,29440448,,,,,,,,
VVEGMQFDR,nt,V,243,false,"Arg/N-end rule seed, prt6 vs. Wt",99,29168982,"MASCOT Score",20.8600000,,-0.1535073,0.8056290,NO,0.20299999415874,-0.5536685
GYISPYFVTDSEK,ph,S,262,false,"srk2dei ABA signaling phopshoproteomics",83,23572148,"MASCOT Score",41.0000000,,,,,,0.0015000
GYISPYFVTDSEK,ph,S,262,false,"TOR Kinase and ABA Receptor",100,29290610,XCorr,3.2722793,0.9192000,,,,0.00081729999510571,
GYISPYFVTDSEK,ph,S,262,false,"Phospho cell culture sucrose/TOR",109,30833711,,,0.8259050,,,,,
MSVEFDNCK,sno,C,272,true,"Site-specific nitrosomeproteomic id - gsnor1-3",90a,25699590,XCorr,2.8281121,,,,,0.00041850001434796,-6.3325093
MSVEFDNCK,sno,C,272,true,"hot5-4 / wildtype, FAT-switch S-nitrosoproteome",169,37277371,,,,-0.4225826,0.3059575,NO,,
MSVEFDNCK,so,C,272,true,"Arabidopsis S-sulfenylation chemoproteomics",108,31578252,"pFind PSM Score",0.0285390,,1.8867900,,,,0.4649211
MSVEFDNCK,so,C,272,true,"S-sulfenylation site detection using YAP1C",110,32714340,,,,,,,,
DLVGVLEDAIR,nt,D,286,false,"Metacaspase9 substrates - in vitro rMC9",51c,23964026,"MASCOT Score",98.0000000,,3.9189277,,NO,,-0.4729257
DLVGVLEDAIR,nt,D,286,false,"Stromal N-terminome",96,26371235,"MASCOT Score",80.8700000,,,,,,
ILTGATVIR,nt,I,348,false,"Arg/N-end rule seed, prt6 vs. Wt",99,29168982,"MASCOT Score",24.5800000,,-1.1148377,0.1807888,NO,0.20370000600815,-0.6910791
EEVGLSLDK,ph,S,362,false,"SIRK1 exp - sirk1 mutant vs WT",86b,23820729,,,,-0.3343642,,NO,,
ETSTIVGDGSTQDAVKKR,nt,E,382,true,"Metacaspase9 substrates - Col-0 / mc9",51a,23964026,"MASCOT Score",52.0000000,,2.0230694,,NO,,-0.2366157
ETSTIVGDGSTQDAVKKR,nt,E,382,true,"Metacaspase9 substrates - in vitro rMC9",51c,23964026,"MASCOT Score",82.0000000,,4.1123118,,NO,,-0.5235374
ETSTIVGDGSTQDAVKK,ac,K,397,true,"Quantitative Acetylproteomics",101,29440448,,,,,,,,
NLIEQAEQDYEKEKLNER,ub,K,416,false,"Arabidopsis ubiquitination COFRADIC",40,26744219,"MaxQuant Score",41.5130000,0.9190000,,,,5.0610000471352E-5,2.5690000
VIQVGAQTE,nt,V,432,false,"Arg/N-end rule seed, prt6 vs. Wt",99,29168982,"MASCOT Score",36.7900000,,0.1992736,0.5705263,NO,0.020530000329018,1.6103023
AAVEEGIVVGGGCTLLR,acy,C,471,false,"Arabidopsis S-acylation atlas - Meristem",163a,35681017,,,,,,,,
AAVEEGIVVGGGCTLLR,sno,C,471,false,"Site-specific nitrosomeproteomic id - gsnor1-3",90b,25699590,XCorr,3.2652442,,,,,0.11959999799728,-7.2060530
AAVEEGIVVGGGCTLLR,sno,C,471,false,"hot5-4 / wildtype, FAT-switch S-nitrosoproteome",169,37277371,,,,,,,,
AAVEEGIVVGGGCTLLR,so,C,471,false,"Arabidopsis S-sulfenylation chemoproteomics",108,31578252,"pFind PSM Score",0.0001313,,1.7948700,,,,-1.4442243
AAVEEGIVVGGGCTLLR,so,C,471,false,"S-sulfenylation site detection using YAP1C",110,32714340,,,,,,,,
LASKVDAIKATLDNDEEK,ph,S,478,true,"STN8 phosphoproteome",38,21768351,"MASCOT Score",62.6500000,,,,,,-0.4842860
LASKVDAIKATLDNDEEK,ph,S,478,true,"Chloroplast kinase substrates",60,19376835,"MASCOT Score",50.0300000,,,,,,-0.4842860
LASKVDAIK,ph,S,478,false,"Phosphoproteome ethylene-regulated time response",46,24043427,"MASCOT Score",42.7300000,,,,,,33.7707000
LASKVDAIK,ph,S,478,false,"Tyrosine phosphorylation in Arabidopsis",59,18463617,"MASCOT Score",24.0000000,,,,,,-0.6839037
LASKVDAIK,ph,S,478,false,"srk2dei ABA signaling phopshoproteomics",83,23572148,"MASCOT Score",40.0000000,,,,,,-0.0004000
LASKVDAIK,ph,S,478,false,"LAXIC - mannitol vs control",84b,23660473,XCorr,2.0600000,1.0000000,,,,0.0016027300152928,
LASKVDAIK,ph,S,478,false,"SnRK2 protein kinase substrates",85,23776212,XCorr,2.6837683,1.0000000,,,,3.7346200087995E-7,
LASKVDAIK,ph,S,478,false,"atm and atr DNA damage response",88,25561503,"MASCOT Score",43.0000000,1.0000000,,,,,-3.4800000
LASKVDAIK,ph,S,478,false,"Tissue atlas Arabidopsis - ProteomicsDB",114,32188942,"MaxQuant score",126.1200000,1.0000000,,,,2.0740799355767E-10,
LASKVDAIK,ac,K,479,false,"Quantitative Acetylproteomics",101,29440448,,,,,,,,
VDAIKATLDNDEEK,hib,K,484,true,"Open search Plant PTM Viewer 2.0 - hib",164e,TBA,,,,,,,,
ATLDNDEEKVGADIVK,ac,K,493,true,"Histone deacetylases - apicidin vs control",98a,29061669,"MaxQuant Score",59.0000000,1.0000000,0.3740000,0.1729816,NO,2.9000000623114E-8,
ATLDNDEEKVGADIVK,ac,K,493,true,"Histone deacetylases substrates - hda14 vs WT",98e,29061669,"MaxQuant Score",45.0000000,1.0000000,-0.3880000,0.9099133,NO,0.0020000000949949,
ATLDNDEEKVGADIVKR,ac,K,500,true,"Quantitative Acetylproteomics",101,29440448,,,,,,,,
VGADIVKR,ac,K,500,true,"Quantitative Acetylproteomics",101,29440448,,,,,,,,
ALSYPLKLIAK,ac,K,508,false,"Histone deacetylases - apicidin vs control",98a,29061669,"MaxQuant Score",92.6000000,1.0000000,0.4590000,0.1770109,NO,0.012000000104308,
ALSYPLKLIAK,ac,K,508,false,"Quantitative Acetylproteomics",101,29440448,,,,,,,,
LIAKNAGVNGSVVSEK,ac,K,512,false,"Quantitative Acetylproteomics",101,29440448,,,,,,,,
NAGVNGSVVSEK,ng,N,517,false,"Conserved N-glycosylation",74,22633491,"MaxQuant Score",76.8240000,1.0000000,,,,0.0010000000474975,-3.5130000
NAGVNGSVVSEK,ph,S,519,false,"Lateral root-induction - NAA vs control",106,23328941,"MASCOT Score",28.0000000,,,,,,
NAGVNGSVVSEK,ph,S,519,false,"Tissue atlas Arabidopsis - ProteomicsDB",114,32188942,"MaxQuant score",153.2200000,0.9999620,,,,1.3569899692811E-7,
NAGVNGSVVSEKVLSNDNVK,ac,K,524,true,"Histone deacetylases substrates - hda14 vs WT",98e,29061669,"MaxQuant Score",76.8000000,1.0000000,-0.0940000,0.9099133,NO,1.4000000270187E-8,
YEDLMAAGIIDPTK,mox,M,546,false,"cat2 Methionine oxidation - 3h stress",62b,25693801,"MASCOT Score",36.0000000,,0.1521109,,NO,,
CCLEHAASVAK,ox,C,559,false,"SPEAR - 10 mM H2O2 / mock",138a,34619326,,,,1.2388848,0.0316486,YES,,
CCLEHAASVAK,ox,C,559,false,"SPEAR - 50 mM H2O2 / mock",138b,34619326,,,,0.6739217,0.0366101,YES,,
CCLEHAASVAK,so,C,559,false,"Arabidopsis S-sulfenylation chemoproteomics",108,31578252,"pFind PSM Score",0.0000383,,1.0262900,,,,-0.6393005
CCLEHAASVAK,so,C,559,false,"S-sulfenylation site detection using YAP1C",110,32714340,,,,,,,,
CCLEHAASVAK,so,C,560,false,"Arabidopsis S-sulfenylation chemoproteomics",108,31578252,"pFind PSM Score",0.0000383,,1.0967000,,,,-0.6393005
CCLEHAASVAK,ph,S,566,false,"srk2dei ABA signaling phopshoproteomics",83,23572148,"MASCOT Score",54.0000000,,,,,,0.0001000
CCLEHAASVAK,ph,S,566,false,"Phospho cell culture sucrose/TOR",109,30833711,,,1.0000000,,,,,
CCLEHAASVAK,ph,S,566,false,"Tissue atlas Arabidopsis - ProteomicsDB",114,32188942,"MaxQuant score",201.0400000,1.0000000,,,,9.2203399500585E-20,
