Peptide,PTM,ModifiedAA,ModifiedPosition,PeptideUniqueToGene,ExperimentDesc,ExpID,PubmedID,ScoreType,IdentScore,LocProb,Log2FChange,PQ-val,QuantSig,PEP,MassErrorPPM
AALSDKLADAYQNARPR,nt,A,2,true,"Stromal N-terminome",96,26371235,"MASCOT Score",37.9500000,,,,,,
AALSDKLADA,nt,A,2,true,"N-term acetylation drought responses",5,26184543,,,,,,,,
AALSDKLADAYQNARPR,nta,A,2,true,"Arg/N-end rule pathway Roots",80,25728785,"MASCOT Score",25.5900000,,,,,0.013330000452697,
AALSDKLADAYQNARPR,nta,A,2,true,"Stromal N-terminome",96,26371235,"MASCOT Score",37.9500000,,,,,,
AALSDKLADAYQNAR,nta,A,2,true,"FtsH12 N-terminome: WT / FtsH12 knockdown miRNA",118,33216923,"MaxQuant score",64.6790000,,,,,0,
AALSDKLADAYQNAR,nta,A,2,true,"HUNTER N-terminome: legumain, GluC and trypsin",119,31951383,"MaxQuant score",87.0830000,,,,,,
AALSDKLADAYQNAR,nta,A,2,true,"Arabidopsis translation initiation landscape - NTA",167a,35069635,,,,,,,,
AALSDKLADAYQN,nta,A,2,true,"HUNTER N-terminome: legumain, GluC and trypsin",119,31951383,"MaxQuant score",78.5560000,,,,,,
AALSDKLADA,nta,A,2,true,"N-term acetylation drought responses",5,26184543,,,,,,,,
ALSDKLADAYQNAR,nta,A,3,true,"HUNTER N-terminome: legumain, GluC and trypsin",119,31951383,"MaxQuant score",45.9730000,,,,,,
AALSDKLADAYQNAR,ub,K,7,true,"upl3 mutant / wildtype",168,35926874,"MaxQuant score",105.1900000,1.0000000,0.8318772,0.1522640,NO,8.2683797586469E-8,-0.9420800
VTATDINEAQLKR,ac,K,69,true,"Quantitative Acetylproteomics",101,29440448,,,,,,,,
VTATDINEAQLKR,ub,K,69,true,"Ubiquitination Membrane Proteins",120,33585938,,,,,,,,
VTATDINEAQLKR,ub,K,69,true,"upl3 mutant / wildtype",168,35926874,"MaxQuant score",179.3500000,1.0000000,0.2630344,0.6659200,NO,4.4649898384342E-18,0.9866000
FDTNCVVTTLK,sno,C,274,true,"hot5-4 / wildtype, FAT-switch S-nitrosoproteome",169,37277371,,,,0.0274050,0.6147761,NO,,
