Peptide,PTM,ModifiedAA,ModifiedPosition,PeptideUniqueToGene,ExperimentDesc,ExpID,PubmedID,ScoreType,IdentScore,LocProb,Log2FChange,PQ-val,QuantSig,PEP,MassErrorPPM
SSSIDAGHTGCTNEANR,ph,S,386,true,"atm and atr DNA damage response",88,25561503,"MASCOT Score",36.0000000,0.9210000,,,,,0.2200000
SSSIDAGHTGCTNEANR,ph,S,386,true,"Tissue atlas Arabidopsis - ProteomicsDB",114,32188942,"MaxQuant score",170.4800000,0.9990190,,,,3.6508598813954E-22,
SEESGRPSLGLR,ph,S,432,true,"Tissue atlas Arabidopsis - ProteomicsDB",114,32188942,"MaxQuant score",70.1970000,0.9692340,,,,0.00095529400277883,
DDVMKLR,ub,K,1171,true,"Ubiquitination Membrane Proteins",120,33585938,,,,,,,,
AVGGDSVLEDSFAR,ph,S,1361,true,"Plasmamembrane phosphorylation",20,15308754,,,,,,,,
AVGGDSVLEDSFAR,ph,S,1366,true,"Tissue atlas Arabidopsis - ProteomicsDB",114,32188942,"MaxQuant score",212.7000000,1.0000000,,,,2.4802982818549E-43,
DFVMSVDSFAR,ph,S,1657,true,"Plasmamembrane phosphorylation",20,15308754,,,,,,,,
DFVMSVDSFAR,ph,S,1657,true,"Tissue atlas Arabidopsis - ProteomicsDB",114,32188942,"MaxQuant score",141.3800000,0.9999780,,,,1.0757599966382E-7,
LQVVSEWMRPDSIVK,ph,S,1723,true,"Tyrosine phosphorylation in Arabidopsis",59,18463617,"MASCOT Score",22.0000000,,,,,,-0.4287452
