Peptide,PTM,ModifiedAA,ModifiedPosition,PeptideUniqueToGene,ExperimentDesc,ExpID,PubmedID,ScoreType,IdentScore,LocProb,Log2FChange,PQ-val,QuantSig,PEP,MassErrorPPM
DLAQDREE,nt,D,68,true,"Arg/N-end rule seed, prt6 vs. Wt",99,29168982,"MASCOT Score",24.0100000,,-0.3052870,0.0288563,NO,0.05299000069499,-0.6144075
DCCAGFGQVIR,sno,C,101,true,"hot5-4 / wildtype, FAT-switch S-nitrosoproteome",169,37277371,,,,,,,,
NSTLAKEFENLGR,ng,N,163,true,"N-glycan occupancy Arabidopsis glycoproteins",87,23994444,"Ladder score",53.3000000,,,,,,
NSTLAKEFENLGR,ng,N,163,true,"N-Glycopeptide Profiling in Arabidopsis Infloresce",132,27067053,"MOWSE score",21.0000000,,,,,0.0060999998822808,
IEDNYNSTSPTQIHKDGTGGGK,ng,N,181,true,"Conserved N-glycosylation",74,22633491,"MaxQuant Score",193.7500000,1.0000000,,,,0,0.1190000
IEDNYNSTSPTQIHKDGTGGGK,ng,N,181,true,"N-linked Glycan Micro-heterogeneity Arabidopsis",134,29237727,,,,,,,,
IEDNYNSTSPTQIHKDGTGGGK,ng,N,181,true,"UDP-GlcNAc transporter glycopeptide analysis",135,30224661,,,,,,,1.3066332105501E-18,0.7000000
IEDNYNSTSPTQIHK,ng,N,181,true,"N-glycan occupancy Arabidopsis glycoproteins",87,23994444,"Ladder score",72.4000000,,,,,,
IEDNYNSTSPTQIHK,ng,N,181,true,"N-linked Glycan Micro-heterogeneity Arabidopsis",134,29237727,,,,,,,,
IEDNYNSTSPTQIHK,ng,N,181,true,"UDP-GlcNAc transporter glycopeptide analysis",135,30224661,,,,,,,1.3007066889358E-17,0.7000000
