Peptide,PTM,ModifiedAA,ModifiedPosition,PeptideUniqueToGene,ExperimentDesc,ExpID,PubmedID,ScoreType,IdentScore,LocProb,Log2FChange,PQ-val,QuantSig,PEP,MassErrorPPM
KPHLLDSVSPNSMAR,ph,S,19,true,"atm and atr DNA damage response",88,25561503,"MASCOT Score",54.0000000,1.0000000,,,,,-1.2500000
KPHLLDSVSPNSMAR,ph,S,21,true,"SnRK2 protein kinase substrates",85,23776212,XCorr,2.2841341,0.7720000,,,,0.011492799967527,
KPHLLDSVSPNSMAR,ph,S,21,true,"TOR Kinase and ABA Receptor",100,29290610,XCorr,3.7007215,0.9736000,,,,0.00016359999426641,
KPHLLDSVSPNSMAR,ph,S,21,true,"Tissue atlas Arabidopsis - ProteomicsDB",114,32188942,"MaxQuant score",184.3200000,0.9999820,,,,5.6253399980374E-26,
NSSPSHPIAK,ph,S,30,true,"SnRK2 protein kinase substrates",85,23776212,XCorr,2.4750824,0.8630000,,,,0.024863300845027,
NSSPSHPIAK,ph,S,30,true,"atm and atr DNA damage response",88,25561503,"MASCOT Score",22.0000000,0.9940000,,,,,-1.9800000
NSSPSHPIAK,ph,S,30,true,"TOR Kinase and ABA Receptor",100,29290610,XCorr,2.2951040,0.9859000,,,,0.0019160000374541,
DAACEGHVTSPAIANGSLSPEKPVDK,ph,S,307,true,"Tissue atlas Arabidopsis - ProteomicsDB",114,32188942,"MaxQuant score",247.0900000,0.9650790,,,,0,
DAACEGHVTSPAIANGSLSPEKPVDK,ph,S,316,true,"SnRK2 protein kinase substrates",85,23776212,XCorr,3.9057946,0.9990000,,,,1.1181899850499E-9,
DAACEGHVTSPAIANGSLSPEKPVDK,ph,S,316,true,"Col-0 callus - FC Col-0 vs. Col-0 Xray",111a,31410901,,67.5400000,,1.0469685,0.0000000,NO,,1.5996379
DAACEGHVTSPAIANGSLSPEKPVDK,ph,S,316,true,"Col-0 X-ray callus - FC Col-0 vs. Col-0 Xray",111b,31410901,,67.5400000,,1.0469685,0.0000000,NO,,1.5996379
DAACEGHVTSPAIANGSLSPEKPVDK,ph,S,316,true,"atm callus - FC atm vs. atm Xray",111c,31410901,,67.5400000,,2.3827380,0.0000000,NO,,1.5996379
DAACEGHVTSPAIANGSLSPEKPVDK,ph,S,316,true,"atm-3 X-ray callus - FC atm vs. atm Xray",111d,31410901,,67.5400000,,2.3827380,0.0000000,NO,,1.5996379
DAACEGHVTSPAIANGSLSPEKPVDK,ph,S,316,true,"Tissue atlas Arabidopsis - ProteomicsDB",114,32188942,"MaxQuant score",411.9900000,0.9999970,,,,0,
AAHETESACQER,so,C,613,true,"Arabidopsis S-sulfenylation chemoproteomics",108,31578252,"pFind PSM Score",0.0064118,,1.2318300,,,,-1.2082117
SAVSSSEKEYEQISR,ph,S,779,true,"Tissue atlas Arabidopsis - ProteomicsDB",114,32188942,"MaxQuant score",76.5730000,0.8917640,,,,8.3383398305159E-5,
