Peptide,PTM,ModifiedAA,ModifiedPosition,PeptideUniqueToGene,ExperimentDesc,ExpID,PubmedID,ScoreType,IdentScore,LocProb,Log2FChange,PQ-val,QuantSig,PEP,MassErrorPPM
SDSGFGGTSSYGSSGSHTSSK,ph,S,19,true,"Tissue atlas Arabidopsis - ProteomicsDB",114,32188942,"MaxQuant score",207.8100000,0.7680710,,,,0,
SDSGFGGTSSYGSSGSHTSSK,ph,S,21,true,"Tissue atlas Arabidopsis - ProteomicsDB",114,32188942,"MaxQuant score",204.5100000,0.9976500,,,,0,
RSDSGFGGTSSYGSSGSHTSSK,ph,S,28,true,"TOR Kinase and ABA Receptor",100,29290610,XCorr,4.3931279,0.8045000,,,,2.5979999918491E-5,
SDSGFGGTSSYGSSGSHTSSK,ph,S,28,true,"Tissue atlas Arabidopsis - ProteomicsDB",114,32188942,"MaxQuant score",240.4600000,0.9922210,,,,0,
SDSGFGGTSSYGSSGSHTSSK,ph,S,34,true,"Tissue atlas Arabidopsis - ProteomicsDB",114,32188942,"MaxQuant score",162.8300000,0.8576730,,,,5.377379969927E-30,
DNDGNESPRKLDLDGLTPFEK,ph,S,47,true,"srk2dei ABA signaling phopshoproteomics",83,23572148,"MASCOT Score",59.0000000,,,,,,0.0004000
DNDGNESPRKLDLDGLTPFEK,ph,S,47,true,"SnRK2 protein kinase substrates",85,23776212,XCorr,2.2488894,1.0000000,,,,1.5308900458422E-7,
KDNDGNESPR,ph,S,47,true,"SnRK2 protein kinase substrates",85,23776212,XCorr,2.5974648,1.0000000,,,,0.048271998763084,
KDNDGNESPR,ph,S,47,true,"atm and atr DNA damage response",88,25561503,"MASCOT Score",38.0000000,1.0000000,,,,,0.0100000
KDNDGNESPR,ph,S,47,true,"Protein sumoylation and phosphorylation cross-talk",97,28419593,,,,,,,,
KLDLDGLTPFEK,ph,T,57,true,"Tissue atlas Arabidopsis - ProteomicsDB",114,32188942,"MaxQuant score",184.8700000,1.0000000,,,,1.3756799408339E-19,
DIPKPVKSFR,ph,S,100,true,"Tissue atlas Arabidopsis - ProteomicsDB",114,32188942,"MaxQuant score",51.6430000,1.0000000,,,,0.010467099957168,
GVEIVIATPGR,ph,T,229,false,"Tissue atlas Arabidopsis - ProteomicsDB",114,32188942,"MaxQuant score",124.0700000,1.0000000,,,,4.4522501411848E-5,
GCDQITR,sno,C,357,true,"hot5-4 / wildtype, FAT-switch S-nitrosoproteome",169,37277371,,,,,,,,
