Peptide,PTM,ModifiedAA,ModifiedPosition,PeptideUniqueToGene,ExperimentDesc,ExpID,PubmedID,ScoreType,IdentScore,LocProb,Log2FChange,PQ-val,QuantSig,PEP,MassErrorPPM
SEFNILNDGPPKETYVVDDAGVLSR,nt,S,85,true,"N-terminal ChaFRADIC",92,26010716,"MASCOT Score",50.9700000,,,,,3.3809999071266E-13,
SEFNILNDGPPKETYVVDDAGVLSR,nt,S,85,true,"Stromal N-terminome",96,26371235,"MASCOT Score",75.5400000,,,,,,
SEFNILNDGPPKETYVVDDAGVLSR,nt,S,85,true,"HUNTER N-terminome: legumain, GluC and trypsin",119,31951383,"MaxQuant score",272.2000000,,,,,,
SEFNILNDGPPKETYVVDDAGVLSR,nt,S,85,true,"Arabidopsis translation initiation landscape - NT",167b,35069635,,,,,,,,
SEFNILNDGPPKE,nt,S,85,true,"N-terminal ChaFRADIC",92,26010716,"MASCOT Score",55.4100000,,,,,2.9529999210354E-6,
VTKSDLKK,ac,K,112,true,"Quantitative Acetylproteomics",101,29440448,,,,,,,,
VTKSDLK,ac,K,112,true,"Quantitative Acetylproteomics",101,29440448,,,,,,,,
GENILDATVSE,nt,G,190,true,"N-terminal ChaFRADIC",92,26010716,"MASCOT Score",38.1400000,,,,,0.0012029999634251,
YNEAVYSSAKR,ac,K,220,true,"Quantitative Acetylproteomics",101,29440448,,,,,,,,
ESNFKTK,ac,K,247,true,"Quantitative Acetylproteomics",101,29440448,,,,,,,,
TKEETDEKR,ac,K,255,true,"Quantitative Acetylproteomics",101,29440448,,,,,,,,
